记录golanggithub.com/russross/blackfriday/v2v2.1.0github.com/russross/blackfriday/v2.Del
兼容性矩阵
项目级观测与符号/契约验证分别统计,绝不合并。
这些计数不区分符号的调用方式:重载、参数形态和选项被合并统计。某一具体调用方式的行为由样本的契约证明,而不是由这些数字证明。
| 环境 | 置信度 | 观测 | 验证 | 通过率 | 节点 | 最近观测 |
|---|---|---|---|---|---|---|
| go 1.26 · Go · go · linux glibc
观测: PROJECT_PROCESS 4✓
|
LOW | 4 | 0 | 100% | 1 | 2026-08-31 |
snapshot · 2026-09-15
失败聚类
-
已观测 PROJECT_PROCESS 证据缺口 ×3 v2.1.0 os=linux · runtime=go@1.26证据质量: legacy-evidence-incomplete · 环境变体: 1 · 首次记录: 2026-08-21 · 最近观测: 2026-08-26诊断复验候选
-
已观测 PROJECT_TEST 证据缺口 ×2 v2.1.0 os=linux · runtime=go@1.26证据质量: legacy-evidence-incomplete · 环境变体: 1 · 首次记录: 2026-08-26 · 最近观测: 2026-08-26诊断复验候选
-
已观测 UNKNOWN exit 1 证据缺口 ×1 v2.1.0 os=linux · runtime=go@1.26 sha256:f3a5a3011077…panic: interface conversion: interface {} is nil, not *caddy.Replacer · goroutine 1 [running]: …go · unclassified-diagnostic · outer go run · gap stage-unknown证据质量: complete · 环境变体: 1 · 首次记录: 2026-08-27 · 最近观测: 2026-08-27诊断复验候选
-
已观测 PROJECT_TEST exit 1 ×1 v2.1.0 os=linux · runtime=go@1.26 sha256:dda800f87ad3…--- FAIL: TestPathAndMethodMatchers (0.00s) · panic: interface conversion: interface {} is nil, not *caddy.Replacer [recovered, repanicked] …go/test · test-runner-diagnostic · outer go test证据质量: complete · 环境变体: 1 · 首次记录: 2026-08-29 · 最近观测: 2026-08-29
-
已观测 PROJECT_COMPILE exit 1 ×1 v2.1.0 os=linux · runtime=go@1.26 sha256:9b72acad915d…test/contract.go:<n>:<n>: cannot use func(dest string) (destUrl string, title string, matched bool) {…} (value of type func(dest string) (destUrl string, …go/compiler · compiler-diagnostic · outer go run证据质量: complete · 环境变体: 1 · 首次记录: 2026-08-31 · 最近观测: 2026-08-31
-
已观测 PROJECT_TEST exit 1 ×1 v2.1.0 os=linux · runtime=go@1.26 sha256:a45d405e2dee…--- FAIL: TestHeadingNodeParsingATX (0.00s) · panic: runtime error: invalid memory address or nil pointer dereference [recovered, repanicked] …go/test · test-runner-diagnostic · outer go test证据质量: complete · 环境变体: 1 · 首次记录: 2026-08-31 · 最近观测: 2026-08-31
-
已观测 PROJECT_TEST exit 1 ×1 v2.1.0 os=linux · runtime=go@1.26 sha256:f0a768eeb13d…--- FAIL: TestCommonHTMLFlagsRenderingBehavior (0.00s) · FAIL example.com/blackfridayflags 0.003sgo/test · test-runner-diagnostic · outer go test证据质量: complete · 环境变体: 1 · 首次记录: 2026-08-31 · 最近观测: 2026-08-31
-
已观测 UNKNOWN exit 1 证据缺口 ×1 v2.1.0 os=linux · runtime=go@1.26 sha256:0077aae44190…Assertion 2 failed: expected custom heading id prefix <str>, got <str><url><str>_blank\<str> · exit status 1go · unclassified-diagnostic · outer go run · gap stage-unknown证据质量: complete · 环境变体: 1 · 首次记录: 2026-08-31 · 最近观测: 2026-08-31诊断复验候选
-
已观测 UNKNOWN exit 2 证据缺口 ×1 v2.1.0 os=linux · runtime=go@1.26 sha256:00e630595b1e…flag provided but not defined: -e · usage: go run [build flags] [-exec xprog] package [arguments...] · Run <str> for details.go · unclassified-diagnostic · outer go run · gap stage-unknown证据质量: complete · 环境变体: 1 · 首次记录: 2026-08-31 · 最近观测: 2026-08-31诊断复验候选
-
已观测 UNKNOWN exit 1 证据缺口 ×1 v2.1.0 os=linux · runtime=go@1.26 sha256:0fe9af72c24d…Contract verification failed: expected <str>language-go\<str> in FencedCode backtick output, got: <pre><code class=<str>>fmt.Println("testing") …go · unclassified-diagnostic · outer go run · gap stage-unknown证据质量: complete · 环境变体: 1 · 首次记录: 2026-08-31 · 最近观测: 2026-08-31诊断复验候选
-
已观测 UNKNOWN exit 1 证据缺口 ×1 v2.1.0 os=linux · runtime=go@1.26 sha256:16f67eb44d58…Contract verification failed: expected empty Document to have nil FirstChild, got: Heading: <str> · exit status 1go · unclassified-diagnostic · outer go run · gap stage-unknown证据质量: complete · 环境变体: 1 · 首次记录: 2026-08-31 · 最近观测: 2026-08-31诊断复验候选
-
已观测 UNKNOWN exit 1 证据缺口 ×1 v2.1.0 os=linux · runtime=go@1.26 sha256:2d98da748a0c…Contract verification failed: expected raw fenced backticks in paragraph with WithNoExtensions, got: <p><code>go · fmt.Println("testing") …go · unclassified-diagnostic · outer go run · gap stage-unknown证据质量: complete · 环境变体: 1 · 首次记录: 2026-08-31 · 最近观测: 2026-08-31诊断复验候选
显示报告最多的 12 个。此坐标记录的失败聚类共 23 个。其余为单次报告。