Записиgolanggithub.com/remyoudompheng/bigfftv0.0.0-20230129092748-24d4a6f8daecbigfft.Mul
Изменить условия
Текущие условия
bigfft.Mul @v0.0.0-20230129092748-24d4a6f8daecalpine musl · x64 · go 1.26 · go · go
1 из 1 прошли
Проверено — эта сеть выполнила контракт в этой координате.
образец есть — наш запуск в этой координате завершился чисто (1)
- Наблюдения в проектах
- в этой координате ничего
- Проверки контрактом
- 1 / 1
- Последняя запись
- 2026-08-19
Свидетельства, которые можно открыть
Здоровье зависимостей
Разрешение прочитало дерево этого релиза и не нашло зависимостей. Это измерение, а не его отсутствие.
Недавние кластеры сбоев
-
наблюдалось PROCESS_START process start failed Пробел в данных ×6 v0.0.0-20230129092748-24d4a6f8daec sha256:c12549970456…· structured-termination · gap diagnostic-missingКачество данных: partial · Варианты среды: 3 · Первая запись: 2026-08-27 · Последнее наблюдение: 2026-09-14Кандидат на диагностическую перепроверку
-
наблюдалось PROJECT_COMPILE exit 1 Пробел в данных ×3 v0.0.0-20230129092748-24d4a6f8daec runtime=go@1.26 sha256:c2ae6d87252c…go/compiler · build-aggregate · outer go test · gap diagnostic-missingКачество данных: partial · Варианты среды: 2 · Первая запись: 2026-08-27 · Последнее наблюдение: 2026-09-15Кандидат на диагностическую перепроверку
-
наблюдалось PROCESS_START process start failed Пробел в данных ×1 v0.0.0-20230129092748-24d4a6f8daec os=linux · runtime=go sha256:8745334df49d…go · structured-termination · outer go test · gap diagnostic-missingКачество данных: partial · Варианты среды: 1 · Первая запись: 2026-08-27 · Последнее наблюдение: 2026-08-27Кандидат на диагностическую перепроверку
-
наблюдалось PROJECT_TEST exit 1 ×1 v0.0.0-20230129092748-24d4a6f8daec os=linux · runtime=go@1.26 sha256:2eb2ea176f55…panic: test timed out after 10m0s · running tests: · TestImageBaseMatchesTheRealImage (10m0s) · TestImageBaseMatchesTheRealImage/denoland/deno:alpine (9m58s)go/test · test-runner-diagnostic · outer go testКачество данных: complete · Варианты среды: 1 · Первая запись: 2026-08-27 · Последнее наблюдение: 2026-08-27
-
наблюдалось PROJECT_TEST exit 1 ×1 v0.0.0-20230129092748-24d4a6f8daec os=linux · runtime=go@1.26 sha256:7e738c976c51…--- FAIL: TestIntegrationChangedSinceSeesOutOfBandStatusChanges (1.49s) …go/test · test-runner-diagnostic · outer go testКачество данных: complete · Варианты среды: 1 · Первая запись: 2026-08-27 · Последнее наблюдение: 2026-08-27
-
наблюдалось PROJECT_TEST exit 1 ×1 v0.0.0-20230129092748-24d4a6f8daec os=linux · runtime=go@1.26 sha256:5b833cc54230…--- FAIL: TestRemoteShellSensitiveScriptsAreLFPinnedAndStored (0.00s) · deploy_privacy_test.go:<n>: git ls-files: exit status 128 …go/test · test-runner-diagnostic · outer go testКачество данных: complete · Варианты среды: 1 · Первая запись: 2026-08-27 · Последнее наблюдение: 2026-08-27
-
наблюдалось PROJECT_TEST exit 1 ×1 v0.0.0-20230129092748-24d4a6f8daec os=linux · runtime=go@1.26 sha256:150aa1cdf4cb…--- FAIL: TestFindingsPastTheEndRedirects (0.00s) · findingsearch_test.go:<n>: redirected to <str>, want the last real page …go/test · test-runner-diagnostic · outer go testКачество данных: complete · Варианты среды: 1 · Первая запись: 2026-08-27 · Последнее наблюдение: 2026-08-27
-
наблюдалось PROJECT_TEST exit 1 ×1 v0.0.0-20230129092748-24d4a6f8daec os=linux · runtime=go@1.26 sha256:152af075df37…--- FAIL: TestRemoteShellSensitiveScriptsAreLFPinnedAndStored (0.01s) · deploy_privacy_test.go:<n>: git ls-files: exit status 128 …go/test · test-runner-diagnostic · outer go testКачество данных: complete · Варианты среды: 1 · Первая запись: 2026-08-27 · Последнее наблюдение: 2026-08-27
-
наблюдалось PROJECT_TEST exit 1 ×1 v0.0.0-20230129092748-24d4a6f8daec os=linux · runtime=go@1.26 sha256:5fdadd9996c6…--- FAIL: TestFindingsPastTheEndRedirects (0.01s) · findingsearch_test.go:<n>: redirected to <str>, want the last real page …go/test · test-runner-diagnostic · outer go testКачество данных: complete · Варианты среды: 1 · Первая запись: 2026-08-27 · Последнее наблюдение: 2026-08-27
-
наблюдалось UNKNOWN exit 1 Пробел в данных ×1 v0.0.0-20230129092748-24d4a6f8daec os=linux · runtime=go@1.26 sha256:5299cca1c440…assertion 1 failed: dialector struct fields mismatch: DSN=<str>, DriverName=<str> · exit status 1go · unclassified-diagnostic · outer go run · gap stage-unknownКачество данных: complete · Варианты среды: 1 · Первая запись: 2026-08-30 · Последнее наблюдение: 2026-08-30Кандидат на диагностическую перепроверку
-
наблюдалось UNKNOWN exit 1 Пробел в данных ×1 v0.0.0-20230129092748-24d4a6f8daec os=linux · runtime=go@1.26 sha256:121013e5604d…panic: <builtin>:<n>:<n>: unexpected identifier, expected external declaration · goroutine 1 [running]: · main.main() · <path>:<n> +0x1b0go · unclassified-diagnostic · outer go run · gap stage-unknownКачество данных: complete · Варианты среды: 1 · Первая запись: 2026-09-16 · Последнее наблюдение: 2026-09-16Кандидат на диагностическую перепроверку
-
наблюдалось UNKNOWN exit 1 Пробел в данных ×1 v0.0.0-20230129092748-24d4a6f8daec os=linux · runtime=go@1.26 sha256:3087c31c19c0…# command-line-arguments · <path> impossible type assertion: pointNode[0].(*cc.StructType) …go · unclassified-diagnostic · outer go run · gap stage-unknownКачество данных: complete · Варианты среды: 1 · Первая запись: 2026-09-16 · Последнее наблюдение: 2026-09-16Кандидат на диагностическую перепроверку
Показаны 12 наиболее часто сообщаемых из 15 записанных кластеров отказов. Остальные — единичные сообщения.