기록golanggithub.com/remyoudompheng/bigfftv0.0.0-20230129092748-24d4a6f8daec
조건 변경
현재 조건
github.com/remyoudompheng/bigfft @v0.0.0-20230129092748-24d4a6f8daecubuntu glibc · x64 · go 1.26 · go 1
API가 아니라 패키지 전체 집계
7회 중 0회 통과
검증 — 이 네트워크가 이 좌표에서 컨트랙트를 직접 실행했습니다.
샘플 있음 — 이 좌표에서 우리가 실행했고 실패함 (1)
- 프로젝트 관측
- 80 / 87
- 컨트랙트 검증
- 0 / 7
- 사용 기록
- 8
- 독립 보고 peer
- 1
- 마지막 기록
- 2026-09-16
열어 볼 수 있는 증거
의존성 건강도
어떤 해결 과정이 이 릴리스의 트리를 읽었고 의존성이 없었습니다. 빠진 것이 아니라 측정된 것입니다.
최근 실패 클러스터
-
관측됨 PROCESS_START process start failed 증거 공백 ×6 v0.0.0-20230129092748-24d4a6f8daec sha256:c12549970456…· structured-termination · gap diagnostic-missing증거 품질: partial · 환경 변형: 3 · 최초 관측: 2026-08-27 · 마지막 관측: 2026-09-14진단 재검증 후보
-
관측됨 PROJECT_COMPILE exit 1 증거 공백 ×3 v0.0.0-20230129092748-24d4a6f8daec runtime=go@1.26 sha256:c2ae6d87252c…go/compiler · build-aggregate · outer go test · gap diagnostic-missing증거 품질: partial · 환경 변형: 2 · 최초 관측: 2026-08-27 · 마지막 관측: 2026-09-15진단 재검증 후보
-
관측됨 PROCESS_START process start failed 증거 공백 ×1 v0.0.0-20230129092748-24d4a6f8daec os=linux · runtime=go sha256:8745334df49d…go · structured-termination · outer go test · gap diagnostic-missing증거 품질: partial · 환경 변형: 1 · 최초 관측: 2026-08-27 · 마지막 관측: 2026-08-27진단 재검증 후보
-
관측됨 PROJECT_TEST exit 1 ×1 v0.0.0-20230129092748-24d4a6f8daec os=linux · runtime=go@1.26 sha256:2eb2ea176f55…panic: test timed out after 10m0s · running tests: · TestImageBaseMatchesTheRealImage (10m0s) · TestImageBaseMatchesTheRealImage/denoland/deno:alpine (9m58s)go/test · test-runner-diagnostic · outer go test증거 품질: complete · 환경 변형: 1 · 최초 관측: 2026-08-27 · 마지막 관측: 2026-08-27
-
관측됨 PROJECT_TEST exit 1 ×1 v0.0.0-20230129092748-24d4a6f8daec os=linux · runtime=go@1.26 sha256:7e738c976c51…--- FAIL: TestIntegrationChangedSinceSeesOutOfBandStatusChanges (1.49s) …go/test · test-runner-diagnostic · outer go test증거 품질: complete · 환경 변형: 1 · 최초 관측: 2026-08-27 · 마지막 관측: 2026-08-27
-
관측됨 PROJECT_TEST exit 1 ×1 v0.0.0-20230129092748-24d4a6f8daec os=linux · runtime=go@1.26 sha256:5b833cc54230…--- FAIL: TestRemoteShellSensitiveScriptsAreLFPinnedAndStored (0.00s) · deploy_privacy_test.go:<n>: git ls-files: exit status 128 …go/test · test-runner-diagnostic · outer go test증거 품질: complete · 환경 변형: 1 · 최초 관측: 2026-08-27 · 마지막 관측: 2026-08-27
-
관측됨 PROJECT_TEST exit 1 ×1 v0.0.0-20230129092748-24d4a6f8daec os=linux · runtime=go@1.26 sha256:150aa1cdf4cb…--- FAIL: TestFindingsPastTheEndRedirects (0.00s) · findingsearch_test.go:<n>: redirected to <str>, want the last real page …go/test · test-runner-diagnostic · outer go test증거 품질: complete · 환경 변형: 1 · 최초 관측: 2026-08-27 · 마지막 관측: 2026-08-27
-
관측됨 PROJECT_TEST exit 1 ×1 v0.0.0-20230129092748-24d4a6f8daec os=linux · runtime=go@1.26 sha256:152af075df37…--- FAIL: TestRemoteShellSensitiveScriptsAreLFPinnedAndStored (0.01s) · deploy_privacy_test.go:<n>: git ls-files: exit status 128 …go/test · test-runner-diagnostic · outer go test증거 품질: complete · 환경 변형: 1 · 최초 관측: 2026-08-27 · 마지막 관측: 2026-08-27
-
관측됨 PROJECT_TEST exit 1 ×1 v0.0.0-20230129092748-24d4a6f8daec os=linux · runtime=go@1.26 sha256:5fdadd9996c6…--- FAIL: TestFindingsPastTheEndRedirects (0.01s) · findingsearch_test.go:<n>: redirected to <str>, want the last real page …go/test · test-runner-diagnostic · outer go test증거 품질: complete · 환경 변형: 1 · 최초 관측: 2026-08-27 · 마지막 관측: 2026-08-27
-
관측됨 UNKNOWN exit 1 증거 공백 ×1 v0.0.0-20230129092748-24d4a6f8daec os=linux · runtime=go@1.26 sha256:5299cca1c440…assertion 1 failed: dialector struct fields mismatch: DSN=<str>, DriverName=<str> · exit status 1go · unclassified-diagnostic · outer go run · gap stage-unknown증거 품질: complete · 환경 변형: 1 · 최초 관측: 2026-08-30 · 마지막 관측: 2026-08-30진단 재검증 후보
-
관측됨 UNKNOWN exit 1 증거 공백 ×1 v0.0.0-20230129092748-24d4a6f8daec os=linux · runtime=go@1.26 sha256:121013e5604d…panic: <builtin>:<n>:<n>: unexpected identifier, expected external declaration · goroutine 1 [running]: · main.main() · <path>:<n> +0x1b0go · unclassified-diagnostic · outer go run · gap stage-unknown증거 품질: complete · 환경 변형: 1 · 최초 관측: 2026-09-16 · 마지막 관측: 2026-09-16진단 재검증 후보
-
관측됨 UNKNOWN exit 1 증거 공백 ×1 v0.0.0-20230129092748-24d4a6f8daec os=linux · runtime=go@1.26 sha256:3087c31c19c0…# command-line-arguments · <path> impossible type assertion: pointNode[0].(*cc.StructType) …go · unclassified-diagnostic · outer go run · gap stage-unknown증거 품질: complete · 환경 변형: 1 · 최초 관측: 2026-09-16 · 마지막 관측: 2026-09-16진단 재검증 후보
가장 많이 보고된 12개를 보여줍니다. 이 좌표에 기록된 실패 클러스터는 15개입니다. 나머지는 단발 보고입니다.