記録golanggithub.com/remyoudompheng/bigfftv0.0.0-20230129092748-24d4a6f8daec
条件を変更
現在の条件
github.com/remyoudompheng/bigfft @v0.0.0-20230129092748-24d4a6f8daecalpine musl · x64 · go 1.26 · go · go
API ではなくパッケージ全体の合計
1 回中 1 回が成功
検証 — このネットワークがこの座標でコントラクトを実行しました。
サンプルあり — この座標で実行し、問題なく終わった (1)
- プロジェクト観測
- 2 / 2
- コントラクト検証
- 1 / 1
- 使用記録
- 1
- 独立した報告ピア
- 1
- 最終記録
- 2026-08-30
開ける証拠
依存関係のヘルス
ある解決処理がこのリリースのツリーを読み、依存関係はありませんでした。欠落ではなく測定結果です。
最近の失敗クラスター
-
観測済み PROCESS_START process start failed 証拠の欠落 ×6 v0.0.0-20230129092748-24d4a6f8daec sha256:c12549970456…· structured-termination · gap diagnostic-missing証拠品質: partial · 環境バリアント: 3 · 初回記録: 2026-08-27 · 最終観測: 2026-09-14診断再検証候補
-
観測済み PROJECT_COMPILE exit 1 証拠の欠落 ×3 v0.0.0-20230129092748-24d4a6f8daec runtime=go@1.26 sha256:c2ae6d87252c…go/compiler · build-aggregate · outer go test · gap diagnostic-missing証拠品質: partial · 環境バリアント: 2 · 初回記録: 2026-08-27 · 最終観測: 2026-09-15診断再検証候補
-
観測済み PROCESS_START process start failed 証拠の欠落 ×1 v0.0.0-20230129092748-24d4a6f8daec os=linux · runtime=go sha256:8745334df49d…go · structured-termination · outer go test · gap diagnostic-missing証拠品質: partial · 環境バリアント: 1 · 初回記録: 2026-08-27 · 最終観測: 2026-08-27診断再検証候補
-
観測済み PROJECT_TEST exit 1 ×1 v0.0.0-20230129092748-24d4a6f8daec os=linux · runtime=go@1.26 sha256:2eb2ea176f55…panic: test timed out after 10m0s · running tests: · TestImageBaseMatchesTheRealImage (10m0s) · TestImageBaseMatchesTheRealImage/denoland/deno:alpine (9m58s)go/test · test-runner-diagnostic · outer go test証拠品質: complete · 環境バリアント: 1 · 初回記録: 2026-08-27 · 最終観測: 2026-08-27
-
観測済み PROJECT_TEST exit 1 ×1 v0.0.0-20230129092748-24d4a6f8daec os=linux · runtime=go@1.26 sha256:7e738c976c51…--- FAIL: TestIntegrationChangedSinceSeesOutOfBandStatusChanges (1.49s) …go/test · test-runner-diagnostic · outer go test証拠品質: complete · 環境バリアント: 1 · 初回記録: 2026-08-27 · 最終観測: 2026-08-27
-
観測済み PROJECT_TEST exit 1 ×1 v0.0.0-20230129092748-24d4a6f8daec os=linux · runtime=go@1.26 sha256:5b833cc54230…--- FAIL: TestRemoteShellSensitiveScriptsAreLFPinnedAndStored (0.00s) · deploy_privacy_test.go:<n>: git ls-files: exit status 128 …go/test · test-runner-diagnostic · outer go test証拠品質: complete · 環境バリアント: 1 · 初回記録: 2026-08-27 · 最終観測: 2026-08-27
-
観測済み PROJECT_TEST exit 1 ×1 v0.0.0-20230129092748-24d4a6f8daec os=linux · runtime=go@1.26 sha256:150aa1cdf4cb…--- FAIL: TestFindingsPastTheEndRedirects (0.00s) · findingsearch_test.go:<n>: redirected to <str>, want the last real page …go/test · test-runner-diagnostic · outer go test証拠品質: complete · 環境バリアント: 1 · 初回記録: 2026-08-27 · 最終観測: 2026-08-27
-
観測済み PROJECT_TEST exit 1 ×1 v0.0.0-20230129092748-24d4a6f8daec os=linux · runtime=go@1.26 sha256:152af075df37…--- FAIL: TestRemoteShellSensitiveScriptsAreLFPinnedAndStored (0.01s) · deploy_privacy_test.go:<n>: git ls-files: exit status 128 …go/test · test-runner-diagnostic · outer go test証拠品質: complete · 環境バリアント: 1 · 初回記録: 2026-08-27 · 最終観測: 2026-08-27
-
観測済み PROJECT_TEST exit 1 ×1 v0.0.0-20230129092748-24d4a6f8daec os=linux · runtime=go@1.26 sha256:5fdadd9996c6…--- FAIL: TestFindingsPastTheEndRedirects (0.01s) · findingsearch_test.go:<n>: redirected to <str>, want the last real page …go/test · test-runner-diagnostic · outer go test証拠品質: complete · 環境バリアント: 1 · 初回記録: 2026-08-27 · 最終観測: 2026-08-27
-
観測済み UNKNOWN exit 1 証拠の欠落 ×1 v0.0.0-20230129092748-24d4a6f8daec os=linux · runtime=go@1.26 sha256:5299cca1c440…assertion 1 failed: dialector struct fields mismatch: DSN=<str>, DriverName=<str> · exit status 1go · unclassified-diagnostic · outer go run · gap stage-unknown証拠品質: complete · 環境バリアント: 1 · 初回記録: 2026-08-30 · 最終観測: 2026-08-30診断再検証候補
-
観測済み UNKNOWN exit 1 証拠の欠落 ×1 v0.0.0-20230129092748-24d4a6f8daec os=linux · runtime=go@1.26 sha256:121013e5604d…panic: <builtin>:<n>:<n>: unexpected identifier, expected external declaration · goroutine 1 [running]: · main.main() · <path>:<n> +0x1b0go · unclassified-diagnostic · outer go run · gap stage-unknown証拠品質: complete · 環境バリアント: 1 · 初回記録: 2026-09-16 · 最終観測: 2026-09-16診断再検証候補
-
観測済み UNKNOWN exit 1 証拠の欠落 ×1 v0.0.0-20230129092748-24d4a6f8daec os=linux · runtime=go@1.26 sha256:3087c31c19c0…# command-line-arguments · <path> impossible type assertion: pointNode[0].(*cc.StructType) …go · unclassified-diagnostic · outer go run · gap stage-unknown証拠品質: complete · 環境バリアント: 1 · 初回記録: 2026-09-16 · 最終観測: 2026-09-16診断再検証候補
最も多く報告された 12 件を表示しています。この座標に記録された失敗クラスタは 15 件です。残りは単発の報告です。