Recordsgolanggithub.com/remyoudompheng/bigfftv0.0.0-20230129092748-24d4a6f8daec
Change the conditions
Current conditions
github.com/remyoudompheng/bigfft @v0.0.0-20230129092748-24d4a6f8daecalpine musl · x64 · go 1.26 · go · go
package-level total, not an API
1 of 1 passed
Verified — this network ran a contract at this coordinate.
there is a sample here, and our run of it at this coordinate came back clean (1)
- Project observations
- 2 / 2
- Contract verifications
- 1 / 1
- Usage records
- 1
- Independent reporting peers
- 1
- Last recorded
- 2026-08-30
Evidence you can open
Dependency Health
A resolution read this release's tree and found no dependencies. That is a measurement, not a missing one.
Recent failure clusters
-
observed PROCESS_START process start failed Evidence gap ×6 v0.0.0-20230129092748-24d4a6f8daec sha256:c12549970456…· structured-termination · gap diagnostic-missingEvidence quality: partial · Environment variants: 3 · First recorded: 2026-08-27 · Last seen: 2026-09-14Diagnostic re-verification candidate
-
observed PROJECT_COMPILE exit 1 Evidence gap ×3 v0.0.0-20230129092748-24d4a6f8daec runtime=go@1.26 sha256:c2ae6d87252c…go/compiler · build-aggregate · outer go test · gap diagnostic-missingEvidence quality: partial · Environment variants: 2 · First recorded: 2026-08-27 · Last seen: 2026-09-15Diagnostic re-verification candidate
-
observed PROCESS_START process start failed Evidence gap ×1 v0.0.0-20230129092748-24d4a6f8daec os=linux · runtime=go sha256:8745334df49d…go · structured-termination · outer go test · gap diagnostic-missingEvidence quality: partial · Environment variants: 1 · First recorded: 2026-08-27 · Last seen: 2026-08-27Diagnostic re-verification candidate
-
observed PROJECT_TEST exit 1 ×1 v0.0.0-20230129092748-24d4a6f8daec os=linux · runtime=go@1.26 sha256:2eb2ea176f55…panic: test timed out after 10m0s · running tests: · TestImageBaseMatchesTheRealImage (10m0s) · TestImageBaseMatchesTheRealImage/denoland/deno:alpine (9m58s)go/test · test-runner-diagnostic · outer go testEvidence quality: complete · Environment variants: 1 · First recorded: 2026-08-27 · Last seen: 2026-08-27
-
observed PROJECT_TEST exit 1 ×1 v0.0.0-20230129092748-24d4a6f8daec os=linux · runtime=go@1.26 sha256:7e738c976c51…--- FAIL: TestIntegrationChangedSinceSeesOutOfBandStatusChanges (1.49s) …go/test · test-runner-diagnostic · outer go testEvidence quality: complete · Environment variants: 1 · First recorded: 2026-08-27 · Last seen: 2026-08-27
-
observed PROJECT_TEST exit 1 ×1 v0.0.0-20230129092748-24d4a6f8daec os=linux · runtime=go@1.26 sha256:5b833cc54230…--- FAIL: TestRemoteShellSensitiveScriptsAreLFPinnedAndStored (0.00s) · deploy_privacy_test.go:<n>: git ls-files: exit status 128 …go/test · test-runner-diagnostic · outer go testEvidence quality: complete · Environment variants: 1 · First recorded: 2026-08-27 · Last seen: 2026-08-27
-
observed PROJECT_TEST exit 1 ×1 v0.0.0-20230129092748-24d4a6f8daec os=linux · runtime=go@1.26 sha256:150aa1cdf4cb…--- FAIL: TestFindingsPastTheEndRedirects (0.00s) · findingsearch_test.go:<n>: redirected to <str>, want the last real page …go/test · test-runner-diagnostic · outer go testEvidence quality: complete · Environment variants: 1 · First recorded: 2026-08-27 · Last seen: 2026-08-27
-
observed PROJECT_TEST exit 1 ×1 v0.0.0-20230129092748-24d4a6f8daec os=linux · runtime=go@1.26 sha256:152af075df37…--- FAIL: TestRemoteShellSensitiveScriptsAreLFPinnedAndStored (0.01s) · deploy_privacy_test.go:<n>: git ls-files: exit status 128 …go/test · test-runner-diagnostic · outer go testEvidence quality: complete · Environment variants: 1 · First recorded: 2026-08-27 · Last seen: 2026-08-27
-
observed PROJECT_TEST exit 1 ×1 v0.0.0-20230129092748-24d4a6f8daec os=linux · runtime=go@1.26 sha256:5fdadd9996c6…--- FAIL: TestFindingsPastTheEndRedirects (0.01s) · findingsearch_test.go:<n>: redirected to <str>, want the last real page …go/test · test-runner-diagnostic · outer go testEvidence quality: complete · Environment variants: 1 · First recorded: 2026-08-27 · Last seen: 2026-08-27
-
observed UNKNOWN exit 1 Evidence gap ×1 v0.0.0-20230129092748-24d4a6f8daec os=linux · runtime=go@1.26 sha256:5299cca1c440…assertion 1 failed: dialector struct fields mismatch: DSN=<str>, DriverName=<str> · exit status 1go · unclassified-diagnostic · outer go run · gap stage-unknownEvidence quality: complete · Environment variants: 1 · First recorded: 2026-08-30 · Last seen: 2026-08-30Diagnostic re-verification candidate
-
observed UNKNOWN exit 1 Evidence gap ×1 v0.0.0-20230129092748-24d4a6f8daec os=linux · runtime=go@1.26 sha256:121013e5604d…panic: <builtin>:<n>:<n>: unexpected identifier, expected external declaration · goroutine 1 [running]: · main.main() · <path>:<n> +0x1b0go · unclassified-diagnostic · outer go run · gap stage-unknownEvidence quality: complete · Environment variants: 1 · First recorded: 2026-09-16 · Last seen: 2026-09-16Diagnostic re-verification candidate
-
observed UNKNOWN exit 1 Evidence gap ×1 v0.0.0-20230129092748-24d4a6f8daec os=linux · runtime=go@1.26 sha256:3087c31c19c0…# command-line-arguments · <path> impossible type assertion: pointNode[0].(*cc.StructType) …go · unclassified-diagnostic · outer go run · gap stage-unknownEvidence quality: complete · Environment variants: 1 · First recorded: 2026-09-16 · Last seen: 2026-09-16Diagnostic re-verification candidate
Showing the 12 most-reported of 15 recorded failure clusters. The rest are single reports.