Registrosgolanggithub.com/remyoudompheng/bigfftv0.0.0-20230129092748-24d4a6f8daec
Cambiar las condiciones
Condiciones actuales
github.com/remyoudompheng/bigfft @v0.0.0-20230129092748-24d4a6f8daecalpine musl · x64 · go 1.26 · go · go
total del paquete, no una API
1 de 1 pasaron
Verificado: esta red ejecutó un contrato en esta coordenada.
hay una muestra aquí y nuestra ejecución en esta coordenada terminó limpia (1)
- Observaciones de proyectos
- 2 / 2
- Verificaciones de contrato
- 1 / 1
- Registros de uso
- 1
- Peers independientes que reportaron
- 1
- Último registro
- 2026-08-30
Evidencia que puedes abrir
Salud de dependencias
Una resolución leyó el árbol de esta versión y no encontró dependencias. Es una medición, no una que falte.
Clústeres de fallos recientes
-
observado PROCESS_START process start failed Brecha de evidencia ×6 v0.0.0-20230129092748-24d4a6f8daec sha256:c12549970456…· structured-termination · gap diagnostic-missingCalidad de evidencia: partial · Variantes de entorno: 3 · Primer registro: 2026-08-27 · Última observación: 2026-09-14Candidato a reverificación diagnóstica
-
observado PROJECT_COMPILE exit 1 Brecha de evidencia ×3 v0.0.0-20230129092748-24d4a6f8daec runtime=go@1.26 sha256:c2ae6d87252c…go/compiler · build-aggregate · outer go test · gap diagnostic-missingCalidad de evidencia: partial · Variantes de entorno: 2 · Primer registro: 2026-08-27 · Última observación: 2026-09-15Candidato a reverificación diagnóstica
-
observado PROCESS_START process start failed Brecha de evidencia ×1 v0.0.0-20230129092748-24d4a6f8daec os=linux · runtime=go sha256:8745334df49d…go · structured-termination · outer go test · gap diagnostic-missingCalidad de evidencia: partial · Variantes de entorno: 1 · Primer registro: 2026-08-27 · Última observación: 2026-08-27Candidato a reverificación diagnóstica
-
observado PROJECT_TEST exit 1 ×1 v0.0.0-20230129092748-24d4a6f8daec os=linux · runtime=go@1.26 sha256:2eb2ea176f55…panic: test timed out after 10m0s · running tests: · TestImageBaseMatchesTheRealImage (10m0s) · TestImageBaseMatchesTheRealImage/denoland/deno:alpine (9m58s)go/test · test-runner-diagnostic · outer go testCalidad de evidencia: complete · Variantes de entorno: 1 · Primer registro: 2026-08-27 · Última observación: 2026-08-27
-
observado PROJECT_TEST exit 1 ×1 v0.0.0-20230129092748-24d4a6f8daec os=linux · runtime=go@1.26 sha256:7e738c976c51…--- FAIL: TestIntegrationChangedSinceSeesOutOfBandStatusChanges (1.49s) …go/test · test-runner-diagnostic · outer go testCalidad de evidencia: complete · Variantes de entorno: 1 · Primer registro: 2026-08-27 · Última observación: 2026-08-27
-
observado PROJECT_TEST exit 1 ×1 v0.0.0-20230129092748-24d4a6f8daec os=linux · runtime=go@1.26 sha256:5b833cc54230…--- FAIL: TestRemoteShellSensitiveScriptsAreLFPinnedAndStored (0.00s) · deploy_privacy_test.go:<n>: git ls-files: exit status 128 …go/test · test-runner-diagnostic · outer go testCalidad de evidencia: complete · Variantes de entorno: 1 · Primer registro: 2026-08-27 · Última observación: 2026-08-27
-
observado PROJECT_TEST exit 1 ×1 v0.0.0-20230129092748-24d4a6f8daec os=linux · runtime=go@1.26 sha256:150aa1cdf4cb…--- FAIL: TestFindingsPastTheEndRedirects (0.00s) · findingsearch_test.go:<n>: redirected to <str>, want the last real page …go/test · test-runner-diagnostic · outer go testCalidad de evidencia: complete · Variantes de entorno: 1 · Primer registro: 2026-08-27 · Última observación: 2026-08-27
-
observado PROJECT_TEST exit 1 ×1 v0.0.0-20230129092748-24d4a6f8daec os=linux · runtime=go@1.26 sha256:152af075df37…--- FAIL: TestRemoteShellSensitiveScriptsAreLFPinnedAndStored (0.01s) · deploy_privacy_test.go:<n>: git ls-files: exit status 128 …go/test · test-runner-diagnostic · outer go testCalidad de evidencia: complete · Variantes de entorno: 1 · Primer registro: 2026-08-27 · Última observación: 2026-08-27
-
observado PROJECT_TEST exit 1 ×1 v0.0.0-20230129092748-24d4a6f8daec os=linux · runtime=go@1.26 sha256:5fdadd9996c6…--- FAIL: TestFindingsPastTheEndRedirects (0.01s) · findingsearch_test.go:<n>: redirected to <str>, want the last real page …go/test · test-runner-diagnostic · outer go testCalidad de evidencia: complete · Variantes de entorno: 1 · Primer registro: 2026-08-27 · Última observación: 2026-08-27
-
observado UNKNOWN exit 1 Brecha de evidencia ×1 v0.0.0-20230129092748-24d4a6f8daec os=linux · runtime=go@1.26 sha256:5299cca1c440…assertion 1 failed: dialector struct fields mismatch: DSN=<str>, DriverName=<str> · exit status 1go · unclassified-diagnostic · outer go run · gap stage-unknownCalidad de evidencia: complete · Variantes de entorno: 1 · Primer registro: 2026-08-30 · Última observación: 2026-08-30Candidato a reverificación diagnóstica
-
observado UNKNOWN exit 1 Brecha de evidencia ×1 v0.0.0-20230129092748-24d4a6f8daec os=linux · runtime=go@1.26 sha256:121013e5604d…panic: <builtin>:<n>:<n>: unexpected identifier, expected external declaration · goroutine 1 [running]: · main.main() · <path>:<n> +0x1b0go · unclassified-diagnostic · outer go run · gap stage-unknownCalidad de evidencia: complete · Variantes de entorno: 1 · Primer registro: 2026-09-16 · Última observación: 2026-09-16Candidato a reverificación diagnóstica
-
observado UNKNOWN exit 1 Brecha de evidencia ×1 v0.0.0-20230129092748-24d4a6f8daec os=linux · runtime=go@1.26 sha256:3087c31c19c0…# command-line-arguments · <path> impossible type assertion: pointNode[0].(*cc.StructType) …go · unclassified-diagnostic · outer go run · gap stage-unknownCalidad de evidencia: complete · Variantes de entorno: 1 · Primer registro: 2026-09-16 · Última observación: 2026-09-16Candidato a reverificación diagnóstica
Se muestran los 12 más reportados de 15 grupos de fallos registrados. El resto son reportes únicos.