Registrosgolanggithub.com/prometheus/commonv0.71.0github.com/prometheus/common/expfmt.FmtOpenMetrics_1_0_0
Cambiar las condiciones
Condiciones actuales
github.com/prometheus/common/expfmt.FmtOpenMetrics_1_0_0 @v0.71.0ubuntu glibc · x64 · node 22 · npm 10 · node
0 de 7 pasaron
Verificado: esta red ejecutó un contrato en esta coordenada.
hay una muestra aquí y nuestra ejecución en esta coordenada falló
- Observaciones de proyectos
- 21 / 21
- Verificaciones de contrato
- 0 / 7
- Peers independientes que reportaron
- 2
- Último registro
- 2026-09-05
Salud de dependencias
Combinaciones observadas y evidencia de fallos para esta versión
Primer fallo observado
v0.71.0
linux · node@22.23 · executionContext=node · moduleSystem=cjs
5 FAIL
· stage: UNKNOWN
· fingerprint: sha256:88af852f99a8104e4bc3c23eea27ebf2990625ccabf45313970f5fd7fe56c4e2
| Biblioteca | Versión | Estado | Medido allí | Proyectos |
|---|---|---|---|---|
| github.com/golang-jwt/jwt/v5 | v5.3.1 | CANDIDATE Cambio correlacionado; combinación no probada | contrato aprobado | 3 días-proyecto |
| github.com/google/go-cmp | v0.7.0 | CANDIDATE Cambio correlacionado; combinación no probada | contrato aprobado | 3 días-proyecto |
| github.com/prometheus/client_model | v0.6.2 | CANDIDATE Cambio correlacionado; combinación no probada | contrato aprobado | 3 días-proyecto |
| github.com/stretchr/testify | v1.12.1 | CANDIDATE Cambio correlacionado; combinación no probada | compilaciones observadas | 3 días-proyecto |
| golang.org/x/net | v0.58.0 | CANDIDATE Cambio correlacionado; combinación no probada | contrato aprobado | 3 días-proyecto |
| golang.org/x/oauth2 | v0.36.0 | CANDIDATE Cambio correlacionado; combinación no probada | contrato aprobado | 3 días-proyecto |
| google.golang.org/protobuf | v1.36.12 | CANDIDATE Cambio correlacionado; combinación no probada | contrato aprobado | 3 días-proyecto |
| github.com/alecthomas/kingpin/v2 | v2.4.0 | UNKNOWN Sin resultado medido vinculado | nada medido | 3 días-proyecto |
| github.com/google/uuid | v1.6.0 | PASS Todas las observaciones pasaron | contrato aprobado | 3 días-proyecto |
| github.com/julienschmidt/httprouter | v1.3.0 | PASS Todas las observaciones pasaron | contrato aprobado | 3 días-proyecto |
| github.com/munnerz/goautoneg | v0.0.0-20191010083416-a7dc8b61c822 | PASS Todas las observaciones pasaron | contrato aprobado | 3 días-proyecto |
| github.com/mwitkow/go-conntrack | v0.0.0-20190716064945-2f068394615f | PASS Todas las observaciones pasaron | contrato aprobado | 3 días-proyecto |
| go.yaml.in/yaml/v2 | v2.4.4 | PASS Todas las observaciones pasaron | contrato aprobado | 3 días-proyecto |
La columna de medición se refiere a la versión de cada dependencia en sí, no al par. Que un resolutor haya colocado dos versiones juntas no prueba que funcionen juntas.
Versiones de dependencias por versión
A qué resolvió sus hijos cada versión de este paquete. Primero va el hijo cuya versión se movió: ahí una actualización cambió algo bajo tus pies.
Se movieron: 10 · iguales en todas las versiones: 12
Una arista registra que un resolutor colocó una versión junto a otra en una máquina real. No afirma que ambas funcionen juntas; a esa pregunta responden las muestras y los contratos, no la presencia de una fila.
Clústeres de fallos recientes
-
observado UNKNOWN exit 1 ERR_MODULE_NOT_FOUND Brecha de evidencia ×5 v0.33.0 → v0.71.0 executionContext=node · moduleSystem=cjs · os=linux · runtime=node@22.23 github.com/prometheus/common/expfmt.FmtOpenMetrics_1_0_0 sha256:88af852f99a8…node:internal/modules/package_json_reader:<n> · throw new ERR_MODULE_NOT_FOUND(packageName, fileURLToPath(base), null); · ^ …node · unclassified-diagnostic · outer node · gap stage-unknownCalidad de evidencia: complete · Variantes de entorno: 1 · Primer registro: 2026-08-29 · Última observación: 2026-09-05Candidato a reverificación diagnóstica
-
observado UNKNOWN exit 1 Brecha de evidencia ×1 v0.71.0 executionContext=node · moduleSystem=cjs · os=linux · runtime=node@22.23 github.com/prometheus/common/expfmt.FmtOpenMetrics_1_0_0 sha256:69ab38336834…assertion 1 failed: expected text/plain; version=0.0.4; charset=utf-8, got text/plain; version=0.0.4; charset=utf-8; escaping=underscores · exit status 1go · unclassified-diagnostic · outer go run · gap stage-unknownCalidad de evidencia: complete · Variantes de entorno: 1 · Primer registro: 2026-09-05 · Última observación: 2026-09-05Candidato a reverificación diagnóstica
-
observado UNKNOWN exit 1 ERR_ASSERTION Brecha de evidencia ×1 v0.71.0 executionContext=node · moduleSystem=cjs · os=linux · runtime=node@22.23 github.com/prometheus/common/expfmt.FmtOpenMetrics_1_0_0 sha256:761ce8fa9777…node:assert:<n> · throw new AssertionError(obj); · ^ · AssertionError [ERR_ASSERTION]: Should yield 4 tokens for const answer = 42;node · unclassified-diagnostic · outer node · gap stage-unknownCalidad de evidencia: complete · Variantes de entorno: 1 · Primer registro: 2026-09-05 · Última observación: 2026-09-05Candidato a reverificación diagnóstica
-
observado UNKNOWN exit 1 Brecha de evidencia ×1 v0.71.0 executionContext=node · moduleSystem=cjs · os=linux · runtime=node@22.23 github.com/prometheus/common/expfmt.FmtOpenMetrics_1_0_0 sha256:3b3190f2cd44…doc: cannot find package <str> in any of: · ($GOROOT not set) · <path> (from $GOPATH)go · unclassified-diagnostic · outer go · gap stage-unknownCalidad de evidencia: complete · Variantes de entorno: 1 · Primer registro: 2026-09-05 · Última observación: 2026-09-05Candidato a reverificación diagnóstica
-
observado UNKNOWN exit 1 ERR_ASSERTION Brecha de evidencia ×1 v0.71.0 executionContext=node · moduleSystem=cjs · os=linux · runtime=node@22.23 github.com/prometheus/common/expfmt.FmtOpenMetrics_1_0_0 sha256:986d98189e70…node:internal/modules/run_main:<n> · triggerUncaughtException( · ^ · AssertionError [ERR_ASSERTION]: Expected values to be strictly equal:node · unclassified-diagnostic · outer node · gap stage-unknownCalidad de evidencia: complete · Variantes de entorno: 1 · Primer registro: 2026-09-05 · Última observación: 2026-09-05Candidato a reverificación diagnóstica
-
observado UNKNOWN exit 1 ERR_ASSERTION Brecha de evidencia ×1 v0.71.0 executionContext=node · moduleSystem=cjs · os=linux · runtime=node@22.23 github.com/prometheus/common/expfmt.FmtOpenMetrics_1_0_0 sha256:b820b4edc1a5…node:internal/modules/run_main:<n> · triggerUncaughtException( · ^ · AssertionError [ERR_ASSERTION]: should produce 4 tokens before eof for <str>node · unclassified-diagnostic · outer node · gap stage-unknownCalidad de evidencia: complete · Variantes de entorno: 1 · Primer registro: 2026-09-05 · Última observación: 2026-09-05Candidato a reverificación diagnóstica
-
observado UNKNOWN exit 1 ERR_ASSERTION Brecha de evidencia ×1 v0.71.0 executionContext=node · moduleSystem=cjs · os=linux · runtime=node@22.23 github.com/prometheus/common/expfmt.FmtOpenMetrics_1_0_0 sha256:d5180246550d…node:internal/modules/run_main:<n> · triggerUncaughtException( · ^ · AssertionError [ERR_ASSERTION]: Expected <str> to be reference-equal to <str>:node · unclassified-diagnostic · outer node · gap stage-unknownCalidad de evidencia: complete · Variantes de entorno: 1 · Primer registro: 2026-09-05 · Última observación: 2026-09-05Candidato a reverificación diagnóstica