Recordsgolanggithub.com/prometheus/commonv0.71.0github.com/prometheus/common/expfmt.Format
Change the conditions
Current conditions
github.com/prometheus/common/expfmt.Format @v0.71.0ubuntu glibc · x64 · node 22 · npm 10 · node
0 of 7 passed
Verified — this network ran a contract at this coordinate.
there is a sample here, and our run of it at this coordinate failed
- Project observations
- 21 / 21
- Contract verifications
- 0 / 7
- Independent reporting peers
- 2
- Last recorded
- 2026-09-05
Dependency Health
Observed combinations and failure evidence for this release
First observed break
v0.71.0
linux · node@22.23 · moduleSystem=cjs · executionContext=node
5 FAIL
· stage: UNKNOWN
· fingerprint: sha256:88af852f99a8104e4bc3c23eea27ebf2990625ccabf45313970f5fd7fe56c4e2
| Library | Version | Health | Measured there | Projects |
|---|---|---|---|---|
| github.com/golang-jwt/jwt/v5 | v5.3.1 | CANDIDATE Correlated change; unproven combination | contract passed | 3 project-days |
| github.com/google/go-cmp | v0.7.0 | CANDIDATE Correlated change; unproven combination | contract passed | 3 project-days |
| github.com/prometheus/client_model | v0.6.2 | CANDIDATE Correlated change; unproven combination | contract passed | 3 project-days |
| github.com/stretchr/testify | v1.12.1 | CANDIDATE Correlated change; unproven combination | builds observed | 3 project-days |
| golang.org/x/net | v0.58.0 | CANDIDATE Correlated change; unproven combination | contract passed | 3 project-days |
| golang.org/x/oauth2 | v0.36.0 | CANDIDATE Correlated change; unproven combination | contract passed | 3 project-days |
| google.golang.org/protobuf | v1.36.12 | CANDIDATE Correlated change; unproven combination | contract passed | 3 project-days |
| github.com/alecthomas/kingpin/v2 | v2.4.0 | UNKNOWN No linked outcome measured | nothing measured | 3 project-days |
| github.com/google/uuid | v1.6.0 | PASS All observations passed | contract passed | 3 project-days |
| github.com/julienschmidt/httprouter | v1.3.0 | PASS All observations passed | contract passed | 3 project-days |
| github.com/munnerz/goautoneg | v0.0.0-20191010083416-a7dc8b61c822 | PASS All observations passed | contract passed | 3 project-days |
| github.com/mwitkow/go-conntrack | v0.0.0-20190716064945-2f068394615f | PASS All observations passed | contract passed | 3 project-days |
| go.yaml.in/yaml/v2 | v2.4.4 | PASS All observations passed | contract passed | 3 project-days |
The measured column is about each dependency's own release, not about the pair. A resolver placing two releases side by side is not evidence that they work together.
Dependency versions across releases
What each release of this package resolved its children to. A child whose version moved is listed first: that is where an upgrade changed something underneath you.
Moved: 10 · unchanged at every release: 12
An edge records that a resolver placed one release beside another on a real machine. It is not a claim that the two work together; that question is answered by samples and contracts, not by presence here.
Recent failure clusters
-
observed UNKNOWN exit 1 ERR_MODULE_NOT_FOUND Evidence gap ×5 v0.33.0 → v0.71.0 executionContext=node · moduleSystem=cjs · os=linux · runtime=node@22.23 github.com/prometheus/common/expfmt.Format sha256:88af852f99a8…node:internal/modules/package_json_reader:<n> · throw new ERR_MODULE_NOT_FOUND(packageName, fileURLToPath(base), null); · ^ …node · unclassified-diagnostic · outer node · gap stage-unknownEvidence quality: complete · Environment variants: 1 · First recorded: 2026-08-29 · Last seen: 2026-09-05Diagnostic re-verification candidate
-
observed UNKNOWN exit 1 Evidence gap ×1 v0.71.0 executionContext=node · moduleSystem=cjs · os=linux · runtime=node@22.23 github.com/prometheus/common/expfmt.Format sha256:69ab38336834…assertion 1 failed: expected text/plain; version=0.0.4; charset=utf-8, got text/plain; version=0.0.4; charset=utf-8; escaping=underscores · exit status 1go · unclassified-diagnostic · outer go run · gap stage-unknownEvidence quality: complete · Environment variants: 1 · First recorded: 2026-09-05 · Last seen: 2026-09-05Diagnostic re-verification candidate
-
observed UNKNOWN exit 1 ERR_ASSERTION Evidence gap ×1 v0.71.0 executionContext=node · moduleSystem=cjs · os=linux · runtime=node@22.23 github.com/prometheus/common/expfmt.Format sha256:761ce8fa9777…node:assert:<n> · throw new AssertionError(obj); · ^ · AssertionError [ERR_ASSERTION]: Should yield 4 tokens for const answer = 42;node · unclassified-diagnostic · outer node · gap stage-unknownEvidence quality: complete · Environment variants: 1 · First recorded: 2026-09-05 · Last seen: 2026-09-05Diagnostic re-verification candidate
-
observed UNKNOWN exit 1 Evidence gap ×1 v0.71.0 executionContext=node · moduleSystem=cjs · os=linux · runtime=node@22.23 github.com/prometheus/common/expfmt.Format sha256:3b3190f2cd44…doc: cannot find package <str> in any of: · ($GOROOT not set) · <path> (from $GOPATH)go · unclassified-diagnostic · outer go · gap stage-unknownEvidence quality: complete · Environment variants: 1 · First recorded: 2026-09-05 · Last seen: 2026-09-05Diagnostic re-verification candidate
-
observed UNKNOWN exit 1 ERR_ASSERTION Evidence gap ×1 v0.71.0 executionContext=node · moduleSystem=cjs · os=linux · runtime=node@22.23 github.com/prometheus/common/expfmt.Format sha256:986d98189e70…node:internal/modules/run_main:<n> · triggerUncaughtException( · ^ · AssertionError [ERR_ASSERTION]: Expected values to be strictly equal:node · unclassified-diagnostic · outer node · gap stage-unknownEvidence quality: complete · Environment variants: 1 · First recorded: 2026-09-05 · Last seen: 2026-09-05Diagnostic re-verification candidate
-
observed UNKNOWN exit 1 ERR_ASSERTION Evidence gap ×1 v0.71.0 executionContext=node · moduleSystem=cjs · os=linux · runtime=node@22.23 github.com/prometheus/common/expfmt.Format sha256:b820b4edc1a5…node:internal/modules/run_main:<n> · triggerUncaughtException( · ^ · AssertionError [ERR_ASSERTION]: should produce 4 tokens before eof for <str>node · unclassified-diagnostic · outer node · gap stage-unknownEvidence quality: complete · Environment variants: 1 · First recorded: 2026-09-05 · Last seen: 2026-09-05Diagnostic re-verification candidate
-
observed UNKNOWN exit 1 ERR_ASSERTION Evidence gap ×1 v0.71.0 executionContext=node · moduleSystem=cjs · os=linux · runtime=node@22.23 github.com/prometheus/common/expfmt.Format sha256:d5180246550d…node:internal/modules/run_main:<n> · triggerUncaughtException( · ^ · AssertionError [ERR_ASSERTION]: Expected <str> to be reference-equal to <str>:node · unclassified-diagnostic · outer node · gap stage-unknownEvidence quality: complete · Environment variants: 1 · First recorded: 2026-09-05 · Last seen: 2026-09-05Diagnostic re-verification candidate