Записиgolanggithub.com/prometheus/commonv0.71.0github.com/prometheus/common/expfmt.NegotiateAccept
Изменить условия
Текущие условия
github.com/prometheus/common/expfmt.NegotiateAccept @v0.71.0linux · glibc · x64 · node 22 · npm 10 · node
0 из 7 прошли
Проверено — эта сеть выполнила контракт в этой координате.
образец есть — наш запуск в этой координате не прошёл
- Наблюдения в проектах
- 21 / 21
- Проверки контрактом
- 0 / 7
- Независимые сообщившие пиры
- 2
- Последняя запись
- 2026-09-05
Здоровье зависимостей
Наблюдаемые комбинации и свидетельства сбоев для этого выпуска
Первый обнаруженный сбой
v0.71.0
linux · node@22.23 · moduleSystem=cjs · executionContext=node
5 FAIL
· stage: UNKNOWN
· fingerprint: sha256:88af852f99a8104e4bc3c23eea27ebf2990625ccabf45313970f5fd7fe56c4e2
| Библиотека | Версия | Состояние | Измерено там | Проектов |
|---|---|---|---|---|
| github.com/golang-jwt/jwt/v5 | v5.3.1 | CANDIDATE Коррелированное изменение; комбинация не подтверждена | контракт пройден | 3 проектных дня |
| github.com/google/go-cmp | v0.7.0 | CANDIDATE Коррелированное изменение; комбинация не подтверждена | контракт пройден | 3 проектных дня |
| github.com/prometheus/client_model | v0.6.2 | CANDIDATE Коррелированное изменение; комбинация не подтверждена | контракт пройден | 3 проектных дня |
| github.com/stretchr/testify | v1.12.1 | CANDIDATE Коррелированное изменение; комбинация не подтверждена | сборки наблюдались | 3 проектных дня |
| golang.org/x/net | v0.58.0 | CANDIDATE Коррелированное изменение; комбинация не подтверждена | контракт пройден | 3 проектных дня |
| golang.org/x/oauth2 | v0.36.0 | CANDIDATE Коррелированное изменение; комбинация не подтверждена | контракт пройден | 3 проектных дня |
| google.golang.org/protobuf | v1.36.12 | CANDIDATE Коррелированное изменение; комбинация не подтверждена | контракт пройден | 3 проектных дня |
| github.com/alecthomas/kingpin/v2 | v2.4.0 | UNKNOWN Нет связанных результатов измерений | ничего не измерено | 3 проектных дня |
| github.com/google/uuid | v1.6.0 | PASS Все наблюдения прошли успешно | контракт пройден | 3 проектных дня |
| github.com/julienschmidt/httprouter | v1.3.0 | PASS Все наблюдения прошли успешно | контракт пройден | 3 проектных дня |
| github.com/munnerz/goautoneg | v0.0.0-20191010083416-a7dc8b61c822 | PASS Все наблюдения прошли успешно | контракт пройден | 3 проектных дня |
| github.com/mwitkow/go-conntrack | v0.0.0-20190716064945-2f068394615f | PASS Все наблюдения прошли успешно | контракт пройден | 3 проектных дня |
| go.yaml.in/yaml/v2 | v2.4.4 | PASS Все наблюдения прошли успешно | контракт пройден | 3 проектных дня |
Столбец измерения относится к релизу самой зависимости, а не к паре. То, что резолвер поставил два релиза рядом, не доказывает, что они работают вместе.
Версии зависимостей по выпускам
К чему каждый выпуск этого пакета разрешил своих потомков. Потомок, чья версия сдвинулась, идёт первым: там обновление изменило что-то под вами.
Сдвинулось: 10 · одинаково во всех выпусках: 12
Ребро фиксирует, что резолвер поставил один релиз рядом с другим на реальной машине. Это не утверждение, что они работают вместе; на этот вопрос отвечают образцы и контракты, а не наличие строки.
Недавние кластеры сбоев
-
наблюдалось UNKNOWN exit 1 ERR_MODULE_NOT_FOUND Пробел в данных ×5 v0.33.0 → v0.71.0 executionContext=node · moduleSystem=cjs · os=linux · runtime=node@22.23 github.com/prometheus/common/expfmt.NegotiateAccept sha256:88af852f99a8…node:internal/modules/package_json_reader:<n> · throw new ERR_MODULE_NOT_FOUND(packageName, fileURLToPath(base), null); · ^ …node · unclassified-diagnostic · outer node · gap stage-unknownКачество данных: complete · Варианты среды: 1 · Первая запись: 2026-08-29 · Последнее наблюдение: 2026-09-05Кандидат на диагностическую перепроверку
-
наблюдалось UNKNOWN exit 1 Пробел в данных ×1 v0.71.0 executionContext=node · moduleSystem=cjs · os=linux · runtime=node@22.23 github.com/prometheus/common/expfmt.NegotiateAccept sha256:69ab38336834…assertion 1 failed: expected text/plain; version=0.0.4; charset=utf-8, got text/plain; version=0.0.4; charset=utf-8; escaping=underscores · exit status 1go · unclassified-diagnostic · outer go run · gap stage-unknownКачество данных: complete · Варианты среды: 1 · Первая запись: 2026-09-05 · Последнее наблюдение: 2026-09-05Кандидат на диагностическую перепроверку
-
наблюдалось UNKNOWN exit 1 ERR_ASSERTION Пробел в данных ×1 v0.71.0 executionContext=node · moduleSystem=cjs · os=linux · runtime=node@22.23 github.com/prometheus/common/expfmt.NegotiateAccept sha256:761ce8fa9777…node:assert:<n> · throw new AssertionError(obj); · ^ · AssertionError [ERR_ASSERTION]: Should yield 4 tokens for const answer = 42;node · unclassified-diagnostic · outer node · gap stage-unknownКачество данных: complete · Варианты среды: 1 · Первая запись: 2026-09-05 · Последнее наблюдение: 2026-09-05Кандидат на диагностическую перепроверку
-
наблюдалось UNKNOWN exit 1 Пробел в данных ×1 v0.71.0 executionContext=node · moduleSystem=cjs · os=linux · runtime=node@22.23 github.com/prometheus/common/expfmt.NegotiateAccept sha256:3b3190f2cd44…doc: cannot find package <str> in any of: · ($GOROOT not set) · <path> (from $GOPATH)go · unclassified-diagnostic · outer go · gap stage-unknownКачество данных: complete · Варианты среды: 1 · Первая запись: 2026-09-05 · Последнее наблюдение: 2026-09-05Кандидат на диагностическую перепроверку
-
наблюдалось UNKNOWN exit 1 ERR_ASSERTION Пробел в данных ×1 v0.71.0 executionContext=node · moduleSystem=cjs · os=linux · runtime=node@22.23 github.com/prometheus/common/expfmt.NegotiateAccept sha256:986d98189e70…node:internal/modules/run_main:<n> · triggerUncaughtException( · ^ · AssertionError [ERR_ASSERTION]: Expected values to be strictly equal:node · unclassified-diagnostic · outer node · gap stage-unknownКачество данных: complete · Варианты среды: 1 · Первая запись: 2026-09-05 · Последнее наблюдение: 2026-09-05Кандидат на диагностическую перепроверку
-
наблюдалось UNKNOWN exit 1 ERR_ASSERTION Пробел в данных ×1 v0.71.0 executionContext=node · moduleSystem=cjs · os=linux · runtime=node@22.23 github.com/prometheus/common/expfmt.NegotiateAccept sha256:b820b4edc1a5…node:internal/modules/run_main:<n> · triggerUncaughtException( · ^ · AssertionError [ERR_ASSERTION]: should produce 4 tokens before eof for <str>node · unclassified-diagnostic · outer node · gap stage-unknownКачество данных: complete · Варианты среды: 1 · Первая запись: 2026-09-05 · Последнее наблюдение: 2026-09-05Кандидат на диагностическую перепроверку
-
наблюдалось UNKNOWN exit 1 ERR_ASSERTION Пробел в данных ×1 v0.71.0 executionContext=node · moduleSystem=cjs · os=linux · runtime=node@22.23 github.com/prometheus/common/expfmt.NegotiateAccept sha256:d5180246550d…node:internal/modules/run_main:<n> · triggerUncaughtException( · ^ · AssertionError [ERR_ASSERTION]: Expected <str> to be reference-equal to <str>:node · unclassified-diagnostic · outer node · gap stage-unknownКачество данных: complete · Варианты среды: 1 · Первая запись: 2026-09-05 · Последнее наблюдение: 2026-09-05Кандидат на диагностическую перепроверку