记录golanggithub.com/prometheus/commonv0.71.0github.com/prometheus/common/expfmt.NewDecoder
OS × 运行时一览
1○ 12026-09-05
如何阅读单元格: 数字是该比率所依据的已记录观测次数——一次构建每到达一个阶段就留下一条观测,因此它既不是构建数,也不是机器数或人数。旁边的文档是另一个来源不同的事实:该坐标是否有样例,以及我们在那里运行它的结果。
- 该坐标还没有样例
- 有样例 — 我们尚未在该坐标运行过它
- 有样例 — 我们在该坐标运行过,并且干净地结束
- 有样例 — 我们在该坐标运行过,并且失败了
- 有样例 — 该坐标同时记录了通过的和失败的运行
- 没有记录 — 未知,既非“可用”也非“损坏”
- 这一格下面还有层级 — 点击打开
有文档,就说明该坐标有样例。样例是否存在,是关于这个版本和这个 API 的事实,不随操作系统、运行时或包管理器改变;颜色说的是它在你正在看的那个环境里跑得怎么样。
兼容性矩阵
项目级观测与符号/契约验证分别统计,绝不合并。
这些计数不区分符号的调用方式:重载、参数形态和选项被合并统计。某一具体调用方式的行为由样本的契约证明,而不是由这些数字证明。
| 环境 | 置信度 | 观测 | 验证 | 通过率 | 节点 | 最近观测 |
|---|---|---|---|---|---|---|
| go 1.26 · Go · go · linux glibc
观测: PROJECT_PROCESS 2✓
|
LOW | 2 | 0 | 100% | 1 | 2026-09-05 |
| node 22.23 · JS · npm · linux glibc
观测: PROJECT_PROCESS 21✓ — 验证: UNKNOWN 0✓ 7✕
|
ELEVATED FAILURE | 21 | 7 | 75% | 2 | 2026-09-05 |
snapshot · 2026-09-15
失败聚类
-
已观测 UNKNOWN exit 1 ERR_MODULE_NOT_FOUND 证据缺口 ×5 v0.33.0 → v0.71.0 executionContext=node · moduleSystem=cjs · os=linux · runtime=node@22.23 github.com/prometheus/common/expfmt.NewDecoder sha256:88af852f99a8…node:internal/modules/package_json_reader:<n> · throw new ERR_MODULE_NOT_FOUND(packageName, fileURLToPath(base), null); · ^ …node · unclassified-diagnostic · outer node · gap stage-unknown证据质量: complete · 环境变体: 1 · 首次记录: 2026-08-29 · 最近观测: 2026-09-05诊断复验候选
-
已观测 PROJECT_TEST exit 1 ×1 v0.71.0 os=linux · runtime=go@1.26 sha256:b6b777e6b2eb…--- FAIL: TestPromslogLevels (0.00s) · === RUN TestPromslogFormats · contract_test.go:<n>: expected default format <str>, got <str> …go/test · test-runner-diagnostic · outer go test证据质量: complete · 环境变体: 1 · 首次记录: 2026-09-05 · 最近观测: 2026-09-05
-
已观测 UNKNOWN exit 1 证据缺口 ×1 v0.71.0 os=linux · runtime=go@1.26 sha256:042f6e977a16…go: updates to go.mod needed; to update it: · go mod tidygo · unclassified-diagnostic · outer go run · gap stage-unknown证据质量: complete · 环境变体: 1 · 首次记录: 2026-09-05 · 最近观测: 2026-09-05诊断复验候选
-
已观测 UNKNOWN exit 1 证据缺口 ×1 v0.71.0 executionContext=node · moduleSystem=cjs · os=linux · runtime=node@22.23 github.com/prometheus/common/expfmt.NewDecoder sha256:69ab38336834…assertion 1 failed: expected text/plain; version=0.0.4; charset=utf-8, got text/plain; version=0.0.4; charset=utf-8; escaping=underscores · exit status 1go · unclassified-diagnostic · outer go run · gap stage-unknown证据质量: complete · 环境变体: 1 · 首次记录: 2026-09-05 · 最近观测: 2026-09-05诊断复验候选
-
已观测 UNKNOWN exit 1 证据缺口 ×1 v0.71.0 os=linux · runtime=go@1.26 sha256:ccff0aa5ca9d…expected default format logfmt, got · exit status 1go · unclassified-diagnostic · outer go run · gap stage-unknown证据质量: complete · 环境变体: 1 · 首次记录: 2026-09-05 · 最近观测: 2026-09-05诊断复验候选
-
已观测 UNKNOWN exit 1 ERR_ASSERTION 证据缺口 ×1 v0.71.0 executionContext=node · moduleSystem=cjs · os=linux · runtime=node@22.23 github.com/prometheus/common/expfmt.NewDecoder sha256:761ce8fa9777…node:assert:<n> · throw new AssertionError(obj); · ^ · AssertionError [ERR_ASSERTION]: Should yield 4 tokens for const answer = 42;node · unclassified-diagnostic · outer node · gap stage-unknown证据质量: complete · 环境变体: 1 · 首次记录: 2026-09-05 · 最近观测: 2026-09-05诊断复验候选
-
已观测 UNKNOWN exit 1 证据缺口 ×1 v0.71.0 executionContext=node · moduleSystem=cjs · os=linux · runtime=node@22.23 github.com/prometheus/common/expfmt.NewDecoder sha256:3b3190f2cd44…doc: cannot find package <str> in any of: · ($GOROOT not set) · <path> (from $GOPATH)go · unclassified-diagnostic · outer go · gap stage-unknown证据质量: complete · 环境变体: 1 · 首次记录: 2026-09-05 · 最近观测: 2026-09-05诊断复验候选
-
已观测 UNKNOWN exit 1 ERR_ASSERTION 证据缺口 ×1 v0.71.0 executionContext=node · moduleSystem=cjs · os=linux · runtime=node@22.23 github.com/prometheus/common/expfmt.NewDecoder sha256:986d98189e70…node:internal/modules/run_main:<n> · triggerUncaughtException( · ^ · AssertionError [ERR_ASSERTION]: Expected values to be strictly equal:node · unclassified-diagnostic · outer node · gap stage-unknown证据质量: complete · 环境变体: 1 · 首次记录: 2026-09-05 · 最近观测: 2026-09-05诊断复验候选
-
已观测 UNKNOWN exit 1 ERR_ASSERTION 证据缺口 ×1 v0.71.0 executionContext=node · moduleSystem=cjs · os=linux · runtime=node@22.23 github.com/prometheus/common/expfmt.NewDecoder sha256:b820b4edc1a5…node:internal/modules/run_main:<n> · triggerUncaughtException( · ^ · AssertionError [ERR_ASSERTION]: should produce 4 tokens before eof for <str>node · unclassified-diagnostic · outer node · gap stage-unknown证据质量: complete · 环境变体: 1 · 首次记录: 2026-09-05 · 最近观测: 2026-09-05诊断复验候选
-
已观测 UNKNOWN exit 1 ERR_ASSERTION 证据缺口 ×1 v0.71.0 executionContext=node · moduleSystem=cjs · os=linux · runtime=node@22.23 github.com/prometheus/common/expfmt.NewDecoder sha256:d5180246550d…node:internal/modules/run_main:<n> · triggerUncaughtException( · ^ · AssertionError [ERR_ASSERTION]: Expected <str> to be reference-equal to <str>:node · unclassified-diagnostic · outer node · gap stage-unknown证据质量: complete · 环境变体: 1 · 首次记录: 2026-09-05 · 最近观测: 2026-09-05诊断复验候选