Записиgolanggithub.com/munnerz/goautonegv0.0.0-20191010083416-a7dc8b61c822
Изменить условия
Текущие условия
github.com/munnerz/goautoneg @v0.0.0-20191010083416-a7dc8b61c822ubuntu glibc · x64 · node 22 · npm 10 · node
итог по пакету, а не API
0 из 7 прошли
Проверено — эта сеть выполнила контракт в этой координате.
образец есть — наш запуск в этой координате не прошёл (1)
- Наблюдения в проектах
- 21 / 21
- Проверки контрактом
- 0 / 7
- Записи об использовании
- 6
- Независимые сообщившие пиры
- 2
- Последняя запись
- 2026-09-05
Свидетельства, которые можно открыть
Здоровье зависимостей
Разрешение прочитало дерево этого релиза и не нашло зависимостей. Это измерение, а не его отсутствие.
Недавние кластеры сбоев
-
наблюдалось UNKNOWN exit 1 Пробел в данных ×1 v0.0.0-20191010083416-a7dc8b61c822 executionContext=node · moduleSystem=cjs · os=linux · runtime=node@22.23 sha256:69ab38336834…assertion 1 failed: expected text/plain; version=0.0.4; charset=utf-8, got text/plain; version=0.0.4; charset=utf-8; escaping=underscores · exit status 1go · unclassified-diagnostic · outer go run · gap stage-unknownКачество данных: complete · Варианты среды: 1 · Первая запись: 2026-09-05 · Последнее наблюдение: 2026-09-05Кандидат на диагностическую перепроверку
-
наблюдалось UNKNOWN exit 1 ERR_ASSERTION Пробел в данных ×1 v0.0.0-20191010083416-a7dc8b61c822 executionContext=node · moduleSystem=cjs · os=linux · runtime=node@22.23 sha256:761ce8fa9777…node:assert:<n> · throw new AssertionError(obj); · ^ · AssertionError [ERR_ASSERTION]: Should yield 4 tokens for const answer = 42;node · unclassified-diagnostic · outer node · gap stage-unknownКачество данных: complete · Варианты среды: 1 · Первая запись: 2026-09-05 · Последнее наблюдение: 2026-09-05Кандидат на диагностическую перепроверку
-
наблюдалось UNKNOWN exit 1 ERR_MODULE_NOT_FOUND Пробел в данных ×1 v0.0.0-20191010083416-a7dc8b61c822 executionContext=node · moduleSystem=cjs · os=linux · runtime=node@22.23 sha256:88af852f99a8…node:internal/modules/package_json_reader:<n> · throw new ERR_MODULE_NOT_FOUND(packageName, fileURLToPath(base), null); · ^ …node · unclassified-diagnostic · outer node · gap stage-unknownКачество данных: complete · Варианты среды: 1 · Первая запись: 2026-09-05 · Последнее наблюдение: 2026-09-05Кандидат на диагностическую перепроверку
-
наблюдалось UNKNOWN exit 1 Пробел в данных ×1 v0.0.0-20191010083416-a7dc8b61c822 executionContext=node · moduleSystem=cjs · os=linux · runtime=node@22.23 sha256:3b3190f2cd44…doc: cannot find package <str> in any of: · ($GOROOT not set) · <path> (from $GOPATH)go · unclassified-diagnostic · outer go · gap stage-unknownКачество данных: complete · Варианты среды: 1 · Первая запись: 2026-09-05 · Последнее наблюдение: 2026-09-05Кандидат на диагностическую перепроверку
-
наблюдалось UNKNOWN exit 1 ERR_ASSERTION Пробел в данных ×1 v0.0.0-20191010083416-a7dc8b61c822 executionContext=node · moduleSystem=cjs · os=linux · runtime=node@22.23 sha256:986d98189e70…node:internal/modules/run_main:<n> · triggerUncaughtException( · ^ · AssertionError [ERR_ASSERTION]: Expected values to be strictly equal:node · unclassified-diagnostic · outer node · gap stage-unknownКачество данных: complete · Варианты среды: 1 · Первая запись: 2026-09-05 · Последнее наблюдение: 2026-09-05Кандидат на диагностическую перепроверку
-
наблюдалось UNKNOWN exit 1 ERR_ASSERTION Пробел в данных ×1 v0.0.0-20191010083416-a7dc8b61c822 executionContext=node · moduleSystem=cjs · os=linux · runtime=node@22.23 sha256:b820b4edc1a5…node:internal/modules/run_main:<n> · triggerUncaughtException( · ^ · AssertionError [ERR_ASSERTION]: should produce 4 tokens before eof for <str>node · unclassified-diagnostic · outer node · gap stage-unknownКачество данных: complete · Варианты среды: 1 · Первая запись: 2026-09-05 · Последнее наблюдение: 2026-09-05Кандидат на диагностическую перепроверку
-
наблюдалось UNKNOWN exit 1 ERR_ASSERTION Пробел в данных ×1 v0.0.0-20191010083416-a7dc8b61c822 executionContext=node · moduleSystem=cjs · os=linux · runtime=node@22.23 sha256:d5180246550d…node:internal/modules/run_main:<n> · triggerUncaughtException( · ^ · AssertionError [ERR_ASSERTION]: Expected <str> to be reference-equal to <str>:node · unclassified-diagnostic · outer node · gap stage-unknownКачество данных: complete · Варианты среды: 1 · Первая запись: 2026-09-05 · Последнее наблюдение: 2026-09-05Кандидат на диагностическую перепроверку