記録golanggithub.com/munnerz/goautonegv0.0.0-20191010083416-a7dc8b61c822
条件を変更
現在の条件
github.com/munnerz/goautoneg @v0.0.0-20191010083416-a7dc8b61c822ubuntu glibc · x64 · node 22 · npm 10 · node
API ではなくパッケージ全体の合計
7 回中 0 回が成功
検証 — このネットワークがこの座標でコントラクトを実行しました。
サンプルあり — この座標で実行し、失敗した (1)
- プロジェクト観測
- 21 / 21
- コントラクト検証
- 0 / 7
- 使用記録
- 6
- 独立した報告ピア
- 2
- 最終記録
- 2026-09-05
開ける証拠
依存関係のヘルス
ある解決処理がこのリリースのツリーを読み、依存関係はありませんでした。欠落ではなく測定結果です。
最近の失敗クラスター
-
観測済み UNKNOWN exit 1 証拠の欠落 ×1 v0.0.0-20191010083416-a7dc8b61c822 executionContext=node · moduleSystem=cjs · os=linux · runtime=node@22.23 sha256:69ab38336834…assertion 1 failed: expected text/plain; version=0.0.4; charset=utf-8, got text/plain; version=0.0.4; charset=utf-8; escaping=underscores · exit status 1go · unclassified-diagnostic · outer go run · gap stage-unknown証拠品質: complete · 環境バリアント: 1 · 初回記録: 2026-09-05 · 最終観測: 2026-09-05診断再検証候補
-
観測済み UNKNOWN exit 1 ERR_ASSERTION 証拠の欠落 ×1 v0.0.0-20191010083416-a7dc8b61c822 executionContext=node · moduleSystem=cjs · os=linux · runtime=node@22.23 sha256:761ce8fa9777…node:assert:<n> · throw new AssertionError(obj); · ^ · AssertionError [ERR_ASSERTION]: Should yield 4 tokens for const answer = 42;node · unclassified-diagnostic · outer node · gap stage-unknown証拠品質: complete · 環境バリアント: 1 · 初回記録: 2026-09-05 · 最終観測: 2026-09-05診断再検証候補
-
観測済み UNKNOWN exit 1 ERR_MODULE_NOT_FOUND 証拠の欠落 ×1 v0.0.0-20191010083416-a7dc8b61c822 executionContext=node · moduleSystem=cjs · os=linux · runtime=node@22.23 sha256:88af852f99a8…node:internal/modules/package_json_reader:<n> · throw new ERR_MODULE_NOT_FOUND(packageName, fileURLToPath(base), null); · ^ …node · unclassified-diagnostic · outer node · gap stage-unknown証拠品質: complete · 環境バリアント: 1 · 初回記録: 2026-09-05 · 最終観測: 2026-09-05診断再検証候補
-
観測済み UNKNOWN exit 1 証拠の欠落 ×1 v0.0.0-20191010083416-a7dc8b61c822 executionContext=node · moduleSystem=cjs · os=linux · runtime=node@22.23 sha256:3b3190f2cd44…doc: cannot find package <str> in any of: · ($GOROOT not set) · <path> (from $GOPATH)go · unclassified-diagnostic · outer go · gap stage-unknown証拠品質: complete · 環境バリアント: 1 · 初回記録: 2026-09-05 · 最終観測: 2026-09-05診断再検証候補
-
観測済み UNKNOWN exit 1 ERR_ASSERTION 証拠の欠落 ×1 v0.0.0-20191010083416-a7dc8b61c822 executionContext=node · moduleSystem=cjs · os=linux · runtime=node@22.23 sha256:986d98189e70…node:internal/modules/run_main:<n> · triggerUncaughtException( · ^ · AssertionError [ERR_ASSERTION]: Expected values to be strictly equal:node · unclassified-diagnostic · outer node · gap stage-unknown証拠品質: complete · 環境バリアント: 1 · 初回記録: 2026-09-05 · 最終観測: 2026-09-05診断再検証候補
-
観測済み UNKNOWN exit 1 ERR_ASSERTION 証拠の欠落 ×1 v0.0.0-20191010083416-a7dc8b61c822 executionContext=node · moduleSystem=cjs · os=linux · runtime=node@22.23 sha256:b820b4edc1a5…node:internal/modules/run_main:<n> · triggerUncaughtException( · ^ · AssertionError [ERR_ASSERTION]: should produce 4 tokens before eof for <str>node · unclassified-diagnostic · outer node · gap stage-unknown証拠品質: complete · 環境バリアント: 1 · 初回記録: 2026-09-05 · 最終観測: 2026-09-05診断再検証候補
-
観測済み UNKNOWN exit 1 ERR_ASSERTION 証拠の欠落 ×1 v0.0.0-20191010083416-a7dc8b61c822 executionContext=node · moduleSystem=cjs · os=linux · runtime=node@22.23 sha256:d5180246550d…node:internal/modules/run_main:<n> · triggerUncaughtException( · ^ · AssertionError [ERR_ASSERTION]: Expected <str> to be reference-equal to <str>:node · unclassified-diagnostic · outer node · gap stage-unknown証拠品質: complete · 環境バリアント: 1 · 初回記録: 2026-09-05 · 最終観測: 2026-09-05診断再検証候補