Recordsgolanggithub.com/munnerz/goautonegv0.0.0-20191010083416-a7dc8b61c822
Change the conditions
Current conditions
github.com/munnerz/goautoneg @v0.0.0-20191010083416-a7dc8b61c822ubuntu glibc · x64 · node 22 · npm 10 · node
package-level total, not an API
0 of 7 passed
Verified — this network ran a contract at this coordinate.
there is a sample here, and our run of it at this coordinate failed (1)
- Project observations
- 21 / 21
- Contract verifications
- 0 / 7
- Usage records
- 6
- Independent reporting peers
- 2
- Last recorded
- 2026-09-05
Evidence you can open
Dependency Health
A resolution read this release's tree and found no dependencies. That is a measurement, not a missing one.
Recent failure clusters
-
observed UNKNOWN exit 1 Evidence gap ×1 v0.0.0-20191010083416-a7dc8b61c822 executionContext=node · moduleSystem=cjs · os=linux · runtime=node@22.23 sha256:69ab38336834…assertion 1 failed: expected text/plain; version=0.0.4; charset=utf-8, got text/plain; version=0.0.4; charset=utf-8; escaping=underscores · exit status 1go · unclassified-diagnostic · outer go run · gap stage-unknownEvidence quality: complete · Environment variants: 1 · First recorded: 2026-09-05 · Last seen: 2026-09-05Diagnostic re-verification candidate
-
observed UNKNOWN exit 1 ERR_ASSERTION Evidence gap ×1 v0.0.0-20191010083416-a7dc8b61c822 executionContext=node · moduleSystem=cjs · os=linux · runtime=node@22.23 sha256:761ce8fa9777…node:assert:<n> · throw new AssertionError(obj); · ^ · AssertionError [ERR_ASSERTION]: Should yield 4 tokens for const answer = 42;node · unclassified-diagnostic · outer node · gap stage-unknownEvidence quality: complete · Environment variants: 1 · First recorded: 2026-09-05 · Last seen: 2026-09-05Diagnostic re-verification candidate
-
observed UNKNOWN exit 1 ERR_MODULE_NOT_FOUND Evidence gap ×1 v0.0.0-20191010083416-a7dc8b61c822 executionContext=node · moduleSystem=cjs · os=linux · runtime=node@22.23 sha256:88af852f99a8…node:internal/modules/package_json_reader:<n> · throw new ERR_MODULE_NOT_FOUND(packageName, fileURLToPath(base), null); · ^ …node · unclassified-diagnostic · outer node · gap stage-unknownEvidence quality: complete · Environment variants: 1 · First recorded: 2026-09-05 · Last seen: 2026-09-05Diagnostic re-verification candidate
-
observed UNKNOWN exit 1 Evidence gap ×1 v0.0.0-20191010083416-a7dc8b61c822 executionContext=node · moduleSystem=cjs · os=linux · runtime=node@22.23 sha256:3b3190f2cd44…doc: cannot find package <str> in any of: · ($GOROOT not set) · <path> (from $GOPATH)go · unclassified-diagnostic · outer go · gap stage-unknownEvidence quality: complete · Environment variants: 1 · First recorded: 2026-09-05 · Last seen: 2026-09-05Diagnostic re-verification candidate
-
observed UNKNOWN exit 1 ERR_ASSERTION Evidence gap ×1 v0.0.0-20191010083416-a7dc8b61c822 executionContext=node · moduleSystem=cjs · os=linux · runtime=node@22.23 sha256:986d98189e70…node:internal/modules/run_main:<n> · triggerUncaughtException( · ^ · AssertionError [ERR_ASSERTION]: Expected values to be strictly equal:node · unclassified-diagnostic · outer node · gap stage-unknownEvidence quality: complete · Environment variants: 1 · First recorded: 2026-09-05 · Last seen: 2026-09-05Diagnostic re-verification candidate
-
observed UNKNOWN exit 1 ERR_ASSERTION Evidence gap ×1 v0.0.0-20191010083416-a7dc8b61c822 executionContext=node · moduleSystem=cjs · os=linux · runtime=node@22.23 sha256:b820b4edc1a5…node:internal/modules/run_main:<n> · triggerUncaughtException( · ^ · AssertionError [ERR_ASSERTION]: should produce 4 tokens before eof for <str>node · unclassified-diagnostic · outer node · gap stage-unknownEvidence quality: complete · Environment variants: 1 · First recorded: 2026-09-05 · Last seen: 2026-09-05Diagnostic re-verification candidate
-
observed UNKNOWN exit 1 ERR_ASSERTION Evidence gap ×1 v0.0.0-20191010083416-a7dc8b61c822 executionContext=node · moduleSystem=cjs · os=linux · runtime=node@22.23 sha256:d5180246550d…node:internal/modules/run_main:<n> · triggerUncaughtException( · ^ · AssertionError [ERR_ASSERTION]: Expected <str> to be reference-equal to <str>:node · unclassified-diagnostic · outer node · gap stage-unknownEvidence quality: complete · Environment variants: 1 · First recorded: 2026-09-05 · Last seen: 2026-09-05Diagnostic re-verification candidate