기록golanggithub.com/go-logr/logrv1.4.2github.com/go-logr/logr.Discard
조건 변경
현재 조건
github.com/go-logr/logr.Discard @v1.4.2ubuntu glibc · x64 · go 1.26 · go 1
3회 중 1회 통과
관측 — 실제 프로젝트 빌드가 이 좌표에서 보고되었습니다.
이 좌표에는 아직 샘플이 없음
- 프로젝트 관측
- 1 / 3
- 컨트랙트 검증
- 이 좌표에는 없음
- 독립 보고 peer
- 1
- fingerprint가 수집된 실패
- 0 / 2
- 마지막 기록
- 2026-08-29
열어 볼 수 있는 증거
의존성 건강도
어떤 해결 과정이 이 릴리스의 트리를 읽었고 의존성이 없었습니다. 빠진 것이 아니라 측정된 것입니다.
최근 실패 클러스터
-
관측됨 PROJECT_TEST 증거 공백 ×20 v1.4.1 → v1.4.2 → v1.4.4 runtime=go@1.26증거 품질: legacy-evidence-incomplete · 환경 변형: 2 · 최초 관측: 2026-08-17 · 마지막 관측: 2026-08-20진단 재검증 후보
-
관측됨 PROJECT_COMPILE exit 1 증거 공백 ×8 v1.4.2 → v1.4.3 → v1.4.4 os=linux · runtime=go@1.26 sha256:c2ae6d87252c…go/compiler · build-aggregate · outer go test · gap diagnostic-missing증거 품질: partial · 환경 변형: 1 · 최초 관측: 2026-08-30 · 마지막 관측: 2026-10-10진단 재검증 후보
-
관측됨 UNKNOWN exit 1 증거 공백 ×3 v1.4.2 → v1.4.4 os=linux · runtime=go@1.26 sha256:52ffb5863abb…FAIL: expected span name <str>, got <str> · exit status 1go · unclassified-diagnostic · outer go run · gap stage-unknown증거 품질: complete · 환경 변형: 1 · 최초 관측: 2026-08-30 · 마지막 관측: 2026-10-10진단 재검증 후보
-
관측됨 PROJECT_PROCESS 증거 공백 ×2 v1.4.2 os=linux · runtime=go@1.26 github.com/go-logr/logr.Discard증거 품질: legacy-evidence-incomplete · 환경 변형: 1 · 최초 관측: 2026-08-29 · 마지막 관측: 2026-08-29진단 재검증 후보
-
관측됨 PROJECT_COMPILE exit 1 ×1 v1.4.2 os=linux · runtime=go@1.26 sha256:089d53aa715f…<path> undefined: sdkmetric.WithAttributesgo/compiler · compiler-diagnostic · outer go test증거 품질: complete · 환경 변형: 1 · 최초 관측: 2026-08-31 · 마지막 관측: 2026-08-31
-
관측됨 PROJECT_TEST exit 1 ×1 v1.4.2 os=linux · runtime=go@1.26 sha256:68a7069b7aae…--- FAIL: TestOTLPMetricHTTPExporterContract (0.00s) · === RUN TestWithTemporalitySelectorOption · --- PASS: TestWithTemporalitySelectorOption (0.00s) …go/test · test-runner-diagnostic · outer go test증거 품질: complete · 환경 변형: 1 · 최초 관측: 2026-08-31 · 마지막 관측: 2026-08-31
-
관측됨 PROJECT_TEST exit 1 ×1 v1.4.2 os=linux · runtime=go@1.26 sha256:da67984267a5…--- FAIL: TestOTLPMetricHTTPExporter (0.00s) · FAIL test_otel 0.134sgo/test · test-runner-diagnostic · outer go test증거 품질: complete · 환경 변형: 1 · 최초 관측: 2026-08-31 · 마지막 관측: 2026-08-31
-
관측됨 UNKNOWN exit 1 증거 공백 ×1 v1.4.2 os=linux · runtime=go@1.26 sha256:2a77dcac8561…Contract test failed: expected error when ExportSpans is called on unstarted exporter, got nil · exit status 1go · unclassified-diagnostic · outer go run · gap stage-unknown증거 품질: complete · 환경 변형: 1 · 최초 관측: 2026-09-01 · 마지막 관측: 2026-09-01진단 재검증 후보
-
관측됨 PROJECT_COMPILE exit 1 ×1 v1.4.2 os=linux · runtime=go@1.26 sha256:e84876b56a4e…test/contract.go:<n>:<n>: assignment mismatch: 1 variable but otlptrace.New returns 2 values …go/compiler · compiler-diagnostic · outer go run증거 품질: complete · 환경 변형: 1 · 최초 관측: 2026-09-02 · 마지막 관측: 2026-09-02
-
관측됨 PROJECT_TEST exit 1 ×1 v1.4.2 os=linux · runtime=go@1.26 sha256:4d9975558e16…--- FAIL: TestWithoutInsecureFailsPlaintext (10.00s) · FAIL example.com/otlptracegrpc-insecure/test 10.009sgo/test · test-runner-diagnostic · outer go test증거 품질: complete · 환경 변형: 1 · 최초 관측: 2026-09-02 · 마지막 관측: 2026-09-02
-
관측됨 PROJECT_TEST exit 1 ×1 v1.4.2 os=linux · runtime=go@1.26 sha256:b6b84f5f81cf…--- FAIL: TestWithInsecureContract (10.00s) · contract_test.go:<n>: expected at least one gRPC trace export request, got none …go/test · test-runner-diagnostic · outer go test증거 품질: complete · 환경 변형: 1 · 최초 관측: 2026-09-02 · 마지막 관측: 2026-09-02
-
관측됨 PROJECT_COMPILE exit 1 ×1 v1.4.2 os=linux · runtime=go@1.26 sha256:d2494a4e5dbf…<path> undefined: otelgrpc.WithPublicEndpointgo/compiler · compiler-diagnostic · outer go run증거 품질: complete · 환경 변형: 1 · 최초 관측: 2026-10-14 · 마지막 관측: 2026-10-14