記録golanggithub.com/go-logr/logrv1.4.2github.com/go-logr/logr.Discard
条件を変更
依存関係のヘルス
ある解決処理がこのリリースのツリーを読み、依存関係はありませんでした。欠落ではなく測定結果です。
最近の失敗クラスター
-
観測済み PROJECT_TEST 証拠の欠落 ×20 v1.4.1 → v1.4.2 → v1.4.4 runtime=go@1.26証拠品質: legacy-evidence-incomplete · 環境バリアント: 2 · 初回記録: 2026-08-17 · 最終観測: 2026-08-20診断再検証候補
-
観測済み PROJECT_COMPILE exit 1 証拠の欠落 ×8 v1.4.2 → v1.4.3 → v1.4.4 os=linux · runtime=go@1.26 sha256:c2ae6d87252c…go/compiler · build-aggregate · outer go test · gap diagnostic-missing証拠品質: partial · 環境バリアント: 1 · 初回記録: 2026-08-30 · 最終観測: 2026-10-10診断再検証候補
-
観測済み UNKNOWN exit 1 証拠の欠落 ×3 v1.4.2 → v1.4.4 os=linux · runtime=go@1.26 sha256:52ffb5863abb…FAIL: expected span name <str>, got <str> · exit status 1go · unclassified-diagnostic · outer go run · gap stage-unknown証拠品質: complete · 環境バリアント: 1 · 初回記録: 2026-08-30 · 最終観測: 2026-10-10診断再検証候補
-
観測済み PROJECT_PROCESS 証拠の欠落 ×2 v1.4.2 os=linux · runtime=go@1.26 github.com/go-logr/logr.Discard証拠品質: legacy-evidence-incomplete · 環境バリアント: 1 · 初回記録: 2026-08-29 · 最終観測: 2026-08-29診断再検証候補
-
観測済み PROJECT_COMPILE exit 1 ×1 v1.4.2 os=linux · runtime=go@1.26 sha256:089d53aa715f…<path> undefined: sdkmetric.WithAttributesgo/compiler · compiler-diagnostic · outer go test証拠品質: complete · 環境バリアント: 1 · 初回記録: 2026-08-31 · 最終観測: 2026-08-31
-
観測済み PROJECT_TEST exit 1 ×1 v1.4.2 os=linux · runtime=go@1.26 sha256:68a7069b7aae…--- FAIL: TestOTLPMetricHTTPExporterContract (0.00s) · === RUN TestWithTemporalitySelectorOption · --- PASS: TestWithTemporalitySelectorOption (0.00s) …go/test · test-runner-diagnostic · outer go test証拠品質: complete · 環境バリアント: 1 · 初回記録: 2026-08-31 · 最終観測: 2026-08-31
-
観測済み PROJECT_TEST exit 1 ×1 v1.4.2 os=linux · runtime=go@1.26 sha256:da67984267a5…--- FAIL: TestOTLPMetricHTTPExporter (0.00s) · FAIL test_otel 0.134sgo/test · test-runner-diagnostic · outer go test証拠品質: complete · 環境バリアント: 1 · 初回記録: 2026-08-31 · 最終観測: 2026-08-31
-
観測済み UNKNOWN exit 1 証拠の欠落 ×1 v1.4.2 os=linux · runtime=go@1.26 sha256:2a77dcac8561…Contract test failed: expected error when ExportSpans is called on unstarted exporter, got nil · exit status 1go · unclassified-diagnostic · outer go run · gap stage-unknown証拠品質: complete · 環境バリアント: 1 · 初回記録: 2026-09-01 · 最終観測: 2026-09-01診断再検証候補
-
観測済み PROJECT_COMPILE exit 1 ×1 v1.4.2 os=linux · runtime=go@1.26 sha256:e84876b56a4e…test/contract.go:<n>:<n>: assignment mismatch: 1 variable but otlptrace.New returns 2 values …go/compiler · compiler-diagnostic · outer go run証拠品質: complete · 環境バリアント: 1 · 初回記録: 2026-09-02 · 最終観測: 2026-09-02
-
観測済み PROJECT_TEST exit 1 ×1 v1.4.2 os=linux · runtime=go@1.26 sha256:4d9975558e16…--- FAIL: TestWithoutInsecureFailsPlaintext (10.00s) · FAIL example.com/otlptracegrpc-insecure/test 10.009sgo/test · test-runner-diagnostic · outer go test証拠品質: complete · 環境バリアント: 1 · 初回記録: 2026-09-02 · 最終観測: 2026-09-02
-
観測済み PROJECT_TEST exit 1 ×1 v1.4.2 os=linux · runtime=go@1.26 sha256:b6b84f5f81cf…--- FAIL: TestWithInsecureContract (10.00s) · contract_test.go:<n>: expected at least one gRPC trace export request, got none …go/test · test-runner-diagnostic · outer go test証拠品質: complete · 環境バリアント: 1 · 初回記録: 2026-09-02 · 最終観測: 2026-09-02
-
観測済み PROJECT_COMPILE exit 1 ×1 v1.4.2 os=linux · runtime=go@1.26 sha256:d2494a4e5dbf…<path> undefined: otelgrpc.WithPublicEndpointgo/compiler · compiler-diagnostic · outer go run証拠品質: complete · 環境バリアント: 1 · 初回記録: 2026-10-14 · 最終観測: 2026-10-14