Relevésgolanggithub.com/go-logr/logrv1.4.2github.com/go-logr/logr.Discard
Changer les conditions
Conditions actuelles
github.com/go-logr/logr.Discard @v1.4.2ubuntu glibc · x64 · go 1.26 · go 1
1 sur 3 ont réussi
Observé — de vrais builds de projets ont fait remonter cette coordonnée.
pas encore d'échantillon à cette coordonnée
- Observations de projets
- 1 / 3
- Vérifications de contrat
- rien à cette coordonnée
- Pairs rapporteurs indépendants
- 1
- Échecs avec empreinte capturée
- 0 / 2
- Dernier enregistrement
- 2026-08-29
Preuves que vous pouvez ouvrir
Santé des dépendances
Une résolution a lu l'arbre de cette version et n'a trouvé aucune dépendance. C'est une mesure, pas une mesure manquante.
Clusters d'échecs récents
-
observé PROJECT_TEST Lacune de preuve ×20 v1.4.1 → v1.4.2 → v1.4.4 runtime=go@1.26Qualité de preuve: legacy-evidence-incomplete · Variantes d’environnement: 2 · Premier relevé: 2026-08-17 · Dernière observation: 2026-08-20Candidat à une revérification diagnostique
-
observé PROJECT_COMPILE exit 1 Lacune de preuve ×8 v1.4.2 → v1.4.3 → v1.4.4 os=linux · runtime=go@1.26 sha256:c2ae6d87252c…go/compiler · build-aggregate · outer go test · gap diagnostic-missingQualité de preuve: partial · Variantes d’environnement: 1 · Premier relevé: 2026-08-30 · Dernière observation: 2026-10-10Candidat à une revérification diagnostique
-
observé UNKNOWN exit 1 Lacune de preuve ×3 v1.4.2 → v1.4.4 os=linux · runtime=go@1.26 sha256:52ffb5863abb…FAIL: expected span name <str>, got <str> · exit status 1go · unclassified-diagnostic · outer go run · gap stage-unknownQualité de preuve: complete · Variantes d’environnement: 1 · Premier relevé: 2026-08-30 · Dernière observation: 2026-10-10Candidat à une revérification diagnostique
-
observé PROJECT_PROCESS Lacune de preuve ×2 v1.4.2 os=linux · runtime=go@1.26 github.com/go-logr/logr.DiscardQualité de preuve: legacy-evidence-incomplete · Variantes d’environnement: 1 · Premier relevé: 2026-08-29 · Dernière observation: 2026-08-29Candidat à une revérification diagnostique
-
observé PROJECT_COMPILE exit 1 ×1 v1.4.2 os=linux · runtime=go@1.26 sha256:089d53aa715f…<path> undefined: sdkmetric.WithAttributesgo/compiler · compiler-diagnostic · outer go testQualité de preuve: complete · Variantes d’environnement: 1 · Premier relevé: 2026-08-31 · Dernière observation: 2026-08-31
-
observé PROJECT_TEST exit 1 ×1 v1.4.2 os=linux · runtime=go@1.26 sha256:68a7069b7aae…--- FAIL: TestOTLPMetricHTTPExporterContract (0.00s) · === RUN TestWithTemporalitySelectorOption · --- PASS: TestWithTemporalitySelectorOption (0.00s) …go/test · test-runner-diagnostic · outer go testQualité de preuve: complete · Variantes d’environnement: 1 · Premier relevé: 2026-08-31 · Dernière observation: 2026-08-31
-
observé PROJECT_TEST exit 1 ×1 v1.4.2 os=linux · runtime=go@1.26 sha256:da67984267a5…--- FAIL: TestOTLPMetricHTTPExporter (0.00s) · FAIL test_otel 0.134sgo/test · test-runner-diagnostic · outer go testQualité de preuve: complete · Variantes d’environnement: 1 · Premier relevé: 2026-08-31 · Dernière observation: 2026-08-31
-
observé UNKNOWN exit 1 Lacune de preuve ×1 v1.4.2 os=linux · runtime=go@1.26 sha256:2a77dcac8561…Contract test failed: expected error when ExportSpans is called on unstarted exporter, got nil · exit status 1go · unclassified-diagnostic · outer go run · gap stage-unknownQualité de preuve: complete · Variantes d’environnement: 1 · Premier relevé: 2026-09-01 · Dernière observation: 2026-09-01Candidat à une revérification diagnostique
-
observé PROJECT_COMPILE exit 1 ×1 v1.4.2 os=linux · runtime=go@1.26 sha256:e84876b56a4e…test/contract.go:<n>:<n>: assignment mismatch: 1 variable but otlptrace.New returns 2 values …go/compiler · compiler-diagnostic · outer go runQualité de preuve: complete · Variantes d’environnement: 1 · Premier relevé: 2026-09-02 · Dernière observation: 2026-09-02
-
observé PROJECT_TEST exit 1 ×1 v1.4.2 os=linux · runtime=go@1.26 sha256:4d9975558e16…--- FAIL: TestWithoutInsecureFailsPlaintext (10.00s) · FAIL example.com/otlptracegrpc-insecure/test 10.009sgo/test · test-runner-diagnostic · outer go testQualité de preuve: complete · Variantes d’environnement: 1 · Premier relevé: 2026-09-02 · Dernière observation: 2026-09-02
-
observé PROJECT_TEST exit 1 ×1 v1.4.2 os=linux · runtime=go@1.26 sha256:b6b84f5f81cf…--- FAIL: TestWithInsecureContract (10.00s) · contract_test.go:<n>: expected at least one gRPC trace export request, got none …go/test · test-runner-diagnostic · outer go testQualité de preuve: complete · Variantes d’environnement: 1 · Premier relevé: 2026-09-02 · Dernière observation: 2026-09-02
-
observé PROJECT_COMPILE exit 1 ×1 v1.4.2 os=linux · runtime=go@1.26 sha256:d2494a4e5dbf…<path> undefined: otelgrpc.WithPublicEndpointgo/compiler · compiler-diagnostic · outer go runQualité de preuve: complete · Variantes d’environnement: 1 · Premier relevé: 2026-10-14 · Dernière observation: 2026-10-14