Aufzeichnungengolanggithub.com/go-logr/logrv1.4.2
Bedingungen ändern
Aktuelle Bedingungen
github.com/go-logr/logr @v1.4.2debian glibc · x64 · go 1.26 · go · go
Paketsumme, keine API
2 von 2 bestanden
Verifiziert — dieses Netzwerk hat an dieser Koordinate einen Contract ausgeführt.
hier gibt es ein Sample, und unser Lauf an dieser Koordinate kam sauber zurück (2)
- Projektbeobachtungen
- 2 / 2
- Contract-Verifikationen
- 2 / 2
- Nutzungsdatensätze
- 2
- Unabhängig meldende Peers
- 1
- Zuletzt erfasst
- 2026-09-07
Nachweise zum Öffnen
Abhängigkeits-Zustand
Eine Auflösung hat den Baum dieses Releases gelesen und keine Abhängigkeiten gefunden. Das ist eine Messung, keine fehlende.
Aktuelle Fehler-Cluster
-
beobachtet PROJECT_TEST Beweislücke ×20 v1.4.1 → v1.4.2 → v1.4.4 runtime=go@1.26Beweisqualität: legacy-evidence-incomplete · Umgebungsvarianten: 2 · Zuerst erfasst: 2026-08-17 · Zuletzt gesehen: 2026-08-20Kandidat für diagnostische Neuprüfung
-
beobachtet PROJECT_COMPILE exit 1 Beweislücke ×8 v1.4.2 → v1.4.3 → v1.4.4 os=linux · runtime=go@1.26 sha256:c2ae6d87252c…go/compiler · build-aggregate · outer go test · gap diagnostic-missingBeweisqualität: partial · Umgebungsvarianten: 1 · Zuerst erfasst: 2026-08-30 · Zuletzt gesehen: 2026-10-10Kandidat für diagnostische Neuprüfung
-
beobachtet UNKNOWN exit 1 Beweislücke ×3 v1.4.2 → v1.4.4 os=linux · runtime=go@1.26 sha256:52ffb5863abb…FAIL: expected span name <str>, got <str> · exit status 1go · unclassified-diagnostic · outer go run · gap stage-unknownBeweisqualität: complete · Umgebungsvarianten: 1 · Zuerst erfasst: 2026-08-30 · Zuletzt gesehen: 2026-10-10Kandidat für diagnostische Neuprüfung
-
beobachtet PROJECT_PROCESS Beweislücke ×2 v1.4.2 os=linux · runtime=go@1.26Beweisqualität: legacy-evidence-incomplete · Umgebungsvarianten: 1 · Zuerst erfasst: 2026-08-29 · Zuletzt gesehen: 2026-08-29Kandidat für diagnostische Neuprüfung
-
beobachtet PROJECT_COMPILE exit 1 ×1 v1.4.2 os=linux · runtime=go@1.26 sha256:089d53aa715f…<path> undefined: sdkmetric.WithAttributesgo/compiler · compiler-diagnostic · outer go testBeweisqualität: complete · Umgebungsvarianten: 1 · Zuerst erfasst: 2026-08-31 · Zuletzt gesehen: 2026-08-31
-
beobachtet PROJECT_TEST exit 1 ×1 v1.4.2 os=linux · runtime=go@1.26 sha256:68a7069b7aae…--- FAIL: TestOTLPMetricHTTPExporterContract (0.00s) · === RUN TestWithTemporalitySelectorOption · --- PASS: TestWithTemporalitySelectorOption (0.00s) …go/test · test-runner-diagnostic · outer go testBeweisqualität: complete · Umgebungsvarianten: 1 · Zuerst erfasst: 2026-08-31 · Zuletzt gesehen: 2026-08-31
-
beobachtet PROJECT_TEST exit 1 ×1 v1.4.2 os=linux · runtime=go@1.26 sha256:da67984267a5…--- FAIL: TestOTLPMetricHTTPExporter (0.00s) · FAIL test_otel 0.134sgo/test · test-runner-diagnostic · outer go testBeweisqualität: complete · Umgebungsvarianten: 1 · Zuerst erfasst: 2026-08-31 · Zuletzt gesehen: 2026-08-31
-
beobachtet UNKNOWN exit 1 Beweislücke ×1 v1.4.2 os=linux · runtime=go@1.26 sha256:2a77dcac8561…Contract test failed: expected error when ExportSpans is called on unstarted exporter, got nil · exit status 1go · unclassified-diagnostic · outer go run · gap stage-unknownBeweisqualität: complete · Umgebungsvarianten: 1 · Zuerst erfasst: 2026-09-01 · Zuletzt gesehen: 2026-09-01Kandidat für diagnostische Neuprüfung
-
beobachtet PROJECT_COMPILE exit 1 ×1 v1.4.2 os=linux · runtime=go@1.26 sha256:e84876b56a4e…test/contract.go:<n>:<n>: assignment mismatch: 1 variable but otlptrace.New returns 2 values …go/compiler · compiler-diagnostic · outer go runBeweisqualität: complete · Umgebungsvarianten: 1 · Zuerst erfasst: 2026-09-02 · Zuletzt gesehen: 2026-09-02
-
beobachtet PROJECT_TEST exit 1 ×1 v1.4.2 os=linux · runtime=go@1.26 sha256:4d9975558e16…--- FAIL: TestWithoutInsecureFailsPlaintext (10.00s) · FAIL example.com/otlptracegrpc-insecure/test 10.009sgo/test · test-runner-diagnostic · outer go testBeweisqualität: complete · Umgebungsvarianten: 1 · Zuerst erfasst: 2026-09-02 · Zuletzt gesehen: 2026-09-02
-
beobachtet PROJECT_TEST exit 1 ×1 v1.4.2 os=linux · runtime=go@1.26 sha256:b6b84f5f81cf…--- FAIL: TestWithInsecureContract (10.00s) · contract_test.go:<n>: expected at least one gRPC trace export request, got none …go/test · test-runner-diagnostic · outer go testBeweisqualität: complete · Umgebungsvarianten: 1 · Zuerst erfasst: 2026-09-02 · Zuletzt gesehen: 2026-09-02
-
beobachtet PROJECT_COMPILE exit 1 ×1 v1.4.2 os=linux · runtime=go@1.26 sha256:d2494a4e5dbf…<path> undefined: otelgrpc.WithPublicEndpointgo/compiler · compiler-diagnostic · outer go runBeweisqualität: complete · Umgebungsvarianten: 1 · Zuerst erfasst: 2026-10-14 · Zuletzt gesehen: 2026-10-14