Registrosgolanggithub.com/flynn/noisev1.0.0github.com/flynn/noise.HandshakeNN
Matriz de compatibilidade
Observações no nível do projeto e verificações de símbolo/contrato são contadas separadamente e nunca somadas.
Estas contagens não distinguem como o símbolo foi chamado: sobrecargas, formatos de argumentos e opções são agrupados. O que uma forma de chamada específica faz é provado pelo contrato de uma amostra, não por estes números.
| Ambiente | Confiança | Observações | Verificado | Taxa de aprovação | Peers | Visto por último |
|---|---|---|---|---|---|---|
| go 1.26 · Go · go · linux glibc
Observações: PROJECT_COMPILE 1✓ 1✕ · PROJECT_PROCESS 14✓
|
MEDIUM | 16 | 0 | 94% | 2 | 2026-09-04 |
snapshot · 2026-09-15
Clusters de falha
-
observado PROJECT_PROCESS ERR_ASSERTION Lacuna de evidência ×6 v1.0.0 executionContext=node · moduleSystem=cjs · os=linux · runtime=node@22.23Qualidade da evidência: legacy-evidence-incomplete · Variantes de ambiente: 1 · Primeiro registro: 2026-08-23 · Visto por último: 2026-08-29Candidato a reverificação diagnóstica
-
observado UNKNOWN exit 1 Lacuna de evidência ×4 v1.0.0 executionContext=node · moduleSystem=cjs · os=linux · runtime=node@22.23 sha256:91ad26545eb1…node:internal/modules/cjs/loader:<n> · throw err; · ^ · Error: Cannot find module <str>node · unclassified-diagnostic · outer node · gap stage-unknownQualidade da evidência: complete · Variantes de ambiente: 1 · Primeiro registro: 2026-08-30 · Visto por último: 2026-08-30Candidato a reverificação diagnóstica
-
observado UNKNOWN exit 1 Lacuna de evidência ×2 v1.0.0 executionContext=node · os=linux · runtime=node@22.23 sha256:9be950af9140…Traceback (most recent call last): · File <str>, line 1, in <module> · ModuleNotFoundError: No module named <str>python3 · unclassified-diagnostic · outer python3 · gap stage-unknownQualidade da evidência: complete · Variantes de ambiente: 2 · Primeiro registro: 2026-08-30 · Visto por último: 2026-08-31Candidato a reverificação diagnóstica
-
observado UNKNOWN exit 1 Lacuna de evidência ×2 v1.0.0 executionContext=node · moduleSystem=esm · os=linux · runtime=node@22.23 sha256:cc724e2e6a32…<path>:<n> · module.exports = require.addon() · ^ · TypeError: require.addon is not a functionnode · unclassified-diagnostic · outer node · gap stage-unknownQualidade da evidência: complete · Variantes de ambiente: 1 · Primeiro registro: 2026-08-30 · Visto por último: 2026-08-31Candidato a reverificação diagnóstica
-
observado PROJECT_PROCESS exit 1 ERR_ASSERTION ×1 v1.0.0 executionContext=node · moduleSystem=cjs · os=linux · runtime=node@22.23 sha256:0e3b7c489c9f…node:internal/modules/run_main:<n> · triggerUncaughtException( · ^ · AssertionError [ERR_ASSERTION]: Expected values to be strictly deep-equal:Qualidade da evidência: complete · Variantes de ambiente: 1 · Primeiro registro: 2026-08-29 · Visto por último: 2026-08-29
-
observado PROJECT_PROCESS exit 1 ERR_ASSERTION ×1 v1.0.0 executionContext=node · moduleSystem=cjs · os=linux · runtime=node@22.23 sha256:c209875bcbeb…node:internal/modules/run_main:<n> · triggerUncaughtException( · ^ …Qualidade da evidência: complete · Variantes de ambiente: 1 · Primeiro registro: 2026-08-29 · Visto por último: 2026-08-29
-
observado PROJECT_PROCESS exit 1 ERR_MODULE_NOT_FOUND ×1 v1.0.0 executionContext=node · moduleSystem=cjs · os=linux · runtime=node@22.23 sha256:c33691aec18d…node:internal/modules/package_json_reader:<n> · throw new ERR_MODULE_NOT_FOUND(packageName, fileURLToPath(base), null); · ^ …Qualidade da evidência: complete · Variantes de ambiente: 1 · Primeiro registro: 2026-08-29 · Visto por último: 2026-08-29
-
observado UNKNOWN exit 1 ERR_ASSERTION Lacuna de evidência ×1 v1.0.0 executionContext=node · moduleSystem=esm · os=linux · runtime=node@22.23 sha256:10e769edac62…node:internal/modules/run_main:<n> · triggerUncaughtException( · ^ · AssertionError [ERR_ASSERTION]: The expression evaluated to a falsy value:node · unclassified-diagnostic · outer node · gap stage-unknownQualidade da evidência: complete · Variantes de ambiente: 1 · Primeiro registro: 2026-08-29 · Visto por último: 2026-08-29Candidato a reverificação diagnóstica
-
observado UNKNOWN exit 1 ERR_ASSERTION Lacuna de evidência ×1 v1.0.0 executionContext=node · moduleSystem=cjs · os=linux · runtime=node@22.23 sha256:07e974cf28d4…Test failed: AssertionError [ERR_ASSERTION]: getFeedURL should return configured feed url · + actual - expected · + <str> · - <str>node · unclassified-diagnostic · outer node · gap stage-unknownQualidade da evidência: complete · Variantes de ambiente: 1 · Primeiro registro: 2026-08-30 · Visto por último: 2026-08-30Candidato a reverificação diagnóstica
-
observado UNKNOWN exit 1 Lacuna de evidência ×1 v1.0.0 executionContext=node · moduleSystem=cjs · os=linux · runtime=node@22.23 sha256:1c03ca490615…Traceback (most recent call last): · File <str>, line 3, in <module> · AttributeError: module <str> has no attribute <str> · IANA_VERSION: <str>python · unclassified-diagnostic · outer python · gap stage-unknownQualidade da evidência: complete · Variantes de ambiente: 1 · Primeiro registro: 2026-08-30 · Visto por último: 2026-08-30Candidato a reverificação diagnóstica
-
observado UNKNOWN exit 1 Lacuna de evidência ×1 v1.0.0 executionContext=node · moduleSystem=cjs · os=linux · runtime=node@22.23 sha256:8310a83be884…node:internal/modules/cjs/loader:<n> · const err = new Error(message); · ^ · Error: Cannot find module <str>node · unclassified-diagnostic · outer node · gap stage-unknownQualidade da evidência: complete · Variantes de ambiente: 1 · Primeiro registro: 2026-08-30 · Visto por último: 2026-08-30Candidato a reverificação diagnóstica
-
observado UNKNOWN exit 1 ERR_MODULE_NOT_FOUND Lacuna de evidência ×1 v1.0.0 executionContext=node · moduleSystem=cjs · os=linux · runtime=node@22.23 sha256:88af852f99a8…node:internal/modules/package_json_reader:<n> · throw new ERR_MODULE_NOT_FOUND(packageName, fileURLToPath(base), null); · ^ …node · unclassified-diagnostic · outer node · gap stage-unknownQualidade da evidência: complete · Variantes de ambiente: 1 · Primeiro registro: 2026-08-30 · Visto por último: 2026-08-30Candidato a reverificação diagnóstica
Mostrando os 12 mais relatados de 23 grupos de falhas registrados. O resto são relatos únicos.