Relevésgolanggithub.com/flynn/noisev1.0.0github.com/flynn/noise.Config
OS × runtime en un coup d'œil
Lire une cellule : Le nombre, ce sont les observations enregistrées que le taux divise : une compilation dépose une observation par étape atteinte, ce n'est donc ni un nombre de builds, ni de machines, ni de personnes. Le document à côté est un autre fait, d'une autre source : l'existence d'un échantillon à cette coordonnée, et le résultat de notre exécution là-bas.
- pas encore d'échantillon à cette coordonnée
- il y a un échantillon ici et nous ne l'avons pas encore exécuté à cette coordonnée
- il y a un échantillon ici et notre exécution à cette coordonnée s'est terminée proprement
- il y a un échantillon ici et notre exécution à cette coordonnée a échoué
- il y a un échantillon ici et cette coordonnée enregistre à la fois une exécution réussie et une exécution en échec
- rien enregistré — inconnu, ni « fonctionne » ni « cassé »
- il y a un niveau sous cette case — cliquez pour l'ouvrir
Un document signifie qu'il y a un échantillon à cette coordonnée. Son EXISTENCE est un fait sur cette version et cette API et ne change pas avec l'OS, le runtime ou le gestionnaire de paquets ; sa COULEUR dit comment cet échantillon s'est exécuté dans l'environnement que vous regardez.
Exemples publiés
- github.com/flynn/noise v1.0.0: Config Ce réseau offre une seule chose : un échantillon qui compile. Il l'a exécuté dans un bac à sable et conservé le reçu signé. Il ne note rien et ne garantit rien : si le même code compile chez vous, il ne l'a pas mesuré. HOWgithub.com/flynn/noise.Config MIT-0 · 2026-09-04
Matrice de compatibilité
Les observations au niveau projet et les vérifications de symbole/contrat sont comptées séparément et jamais additionnées.
Ces chiffres ne distinguent pas la façon dont le symbole a été appelé : surcharges, formes d'arguments et options sont regroupées. Ce que fait une forme d'appel précise est prouvé par le contrat d'un échantillon, pas par ces nombres.
| Environnement | Confiance | Observations | Vérifié | Taux de réussite | Pairs | Dernière observation |
|---|---|---|---|---|---|---|
| go 1.26 · Go · go · linux glibc · docker
Observations: PROJECT_TEST 1✓ — Vérifié: CONTRACT 1✓
|
LOW | 1 | 1 | 100 % | 1 · 1✓ | 2026-09-17 |
| go 1.26 · Go · go · linux glibc
Observations: PROJECT_COMPILE 1✓ 1✕ · PROJECT_PROCESS 17✓
|
MEDIUM | 19 | 0 | 95 % | 2 | 2026-09-04 |
snapshot · 2026-09-17
Clusters d'échecs
-
observé PROJECT_PROCESS ERR_ASSERTION Lacune de preuve ×6 v1.0.0 executionContext=node · moduleSystem=cjs · os=linux · runtime=node@22.23Qualité de preuve: legacy-evidence-incomplete · Variantes d’environnement: 1 · Premier relevé: 2026-08-23 · Dernière observation: 2026-08-29Candidat à une revérification diagnostique
-
observé UNKNOWN exit 1 Lacune de preuve ×4 v1.0.0 executionContext=node · moduleSystem=cjs · os=linux · runtime=node@22.23 sha256:91ad26545eb1…node:internal/modules/cjs/loader:<n> · throw err; · ^ · Error: Cannot find module <str>node · unclassified-diagnostic · outer node · gap stage-unknownQualité de preuve: complete · Variantes d’environnement: 1 · Premier relevé: 2026-08-30 · Dernière observation: 2026-08-30Candidat à une revérification diagnostique
-
observé UNKNOWN exit 1 Lacune de preuve ×2 v1.0.0 executionContext=node · os=linux · runtime=node@22.23 sha256:9be950af9140…Traceback (most recent call last): · File <str>, line 1, in <module> · ModuleNotFoundError: No module named <str>python3 · unclassified-diagnostic · outer python3 · gap stage-unknownQualité de preuve: complete · Variantes d’environnement: 2 · Premier relevé: 2026-08-30 · Dernière observation: 2026-08-31Candidat à une revérification diagnostique
-
observé UNKNOWN exit 1 Lacune de preuve ×2 v1.0.0 executionContext=node · moduleSystem=esm · os=linux · runtime=node@22.23 sha256:cc724e2e6a32…<path>:<n> · module.exports = require.addon() · ^ · TypeError: require.addon is not a functionnode · unclassified-diagnostic · outer node · gap stage-unknownQualité de preuve: complete · Variantes d’environnement: 1 · Premier relevé: 2026-08-30 · Dernière observation: 2026-08-31Candidat à une revérification diagnostique
-
observé PROJECT_PROCESS exit 1 ERR_ASSERTION ×1 v1.0.0 executionContext=node · moduleSystem=cjs · os=linux · runtime=node@22.23 sha256:0e3b7c489c9f…node:internal/modules/run_main:<n> · triggerUncaughtException( · ^ · AssertionError [ERR_ASSERTION]: Expected values to be strictly deep-equal:Qualité de preuve: complete · Variantes d’environnement: 1 · Premier relevé: 2026-08-29 · Dernière observation: 2026-08-29
-
observé PROJECT_PROCESS exit 1 ERR_ASSERTION ×1 v1.0.0 executionContext=node · moduleSystem=cjs · os=linux · runtime=node@22.23 sha256:c209875bcbeb…node:internal/modules/run_main:<n> · triggerUncaughtException( · ^ …Qualité de preuve: complete · Variantes d’environnement: 1 · Premier relevé: 2026-08-29 · Dernière observation: 2026-08-29
-
observé PROJECT_PROCESS exit 1 ERR_MODULE_NOT_FOUND ×1 v1.0.0 executionContext=node · moduleSystem=cjs · os=linux · runtime=node@22.23 sha256:c33691aec18d…node:internal/modules/package_json_reader:<n> · throw new ERR_MODULE_NOT_FOUND(packageName, fileURLToPath(base), null); · ^ …Qualité de preuve: complete · Variantes d’environnement: 1 · Premier relevé: 2026-08-29 · Dernière observation: 2026-08-29
-
observé UNKNOWN exit 1 ERR_ASSERTION Lacune de preuve ×1 v1.0.0 executionContext=node · moduleSystem=esm · os=linux · runtime=node@22.23 sha256:10e769edac62…node:internal/modules/run_main:<n> · triggerUncaughtException( · ^ · AssertionError [ERR_ASSERTION]: The expression evaluated to a falsy value:node · unclassified-diagnostic · outer node · gap stage-unknownQualité de preuve: complete · Variantes d’environnement: 1 · Premier relevé: 2026-08-29 · Dernière observation: 2026-08-29Candidat à une revérification diagnostique
-
observé UNKNOWN exit 1 ERR_ASSERTION Lacune de preuve ×1 v1.0.0 executionContext=node · moduleSystem=cjs · os=linux · runtime=node@22.23 sha256:07e974cf28d4…Test failed: AssertionError [ERR_ASSERTION]: getFeedURL should return configured feed url · + actual - expected · + <str> · - <str>node · unclassified-diagnostic · outer node · gap stage-unknownQualité de preuve: complete · Variantes d’environnement: 1 · Premier relevé: 2026-08-30 · Dernière observation: 2026-08-30Candidat à une revérification diagnostique
-
observé UNKNOWN exit 1 Lacune de preuve ×1 v1.0.0 executionContext=node · moduleSystem=cjs · os=linux · runtime=node@22.23 sha256:1c03ca490615…Traceback (most recent call last): · File <str>, line 3, in <module> · AttributeError: module <str> has no attribute <str> · IANA_VERSION: <str>python · unclassified-diagnostic · outer python · gap stage-unknownQualité de preuve: complete · Variantes d’environnement: 1 · Premier relevé: 2026-08-30 · Dernière observation: 2026-08-30Candidat à une revérification diagnostique
-
observé UNKNOWN exit 1 Lacune de preuve ×1 v1.0.0 executionContext=node · moduleSystem=cjs · os=linux · runtime=node@22.23 sha256:8310a83be884…node:internal/modules/cjs/loader:<n> · const err = new Error(message); · ^ · Error: Cannot find module <str>node · unclassified-diagnostic · outer node · gap stage-unknownQualité de preuve: complete · Variantes d’environnement: 1 · Premier relevé: 2026-08-30 · Dernière observation: 2026-08-30Candidat à une revérification diagnostique
-
observé UNKNOWN exit 1 ERR_MODULE_NOT_FOUND Lacune de preuve ×1 v1.0.0 executionContext=node · moduleSystem=cjs · os=linux · runtime=node@22.23 sha256:88af852f99a8…node:internal/modules/package_json_reader:<n> · throw new ERR_MODULE_NOT_FOUND(packageName, fileURLToPath(base), null); · ^ …node · unclassified-diagnostic · outer node · gap stage-unknownQualité de preuve: complete · Variantes d’environnement: 1 · Premier relevé: 2026-08-30 · Dernière observation: 2026-08-30Candidat à une revérification diagnostique
Affichage des 12 plus signalés parmi 23 groupes d’échecs enregistrés. Le reste sont des signalements uniques.