Aufzeichnungengolanggithub.com/flynn/noisev1.0.0github.com/flynn/noise.CipherChaChaPoly
OS × Runtime auf einen Blick
Eine Zelle lesen: Die Zahl sind die aufgezeichneten Beobachtungen, durch die die Rate teilt — ein Build hinterlässt pro erreichter Stufe eine Beobachtung, also zählt sie weder Builds noch Maschinen noch Personen. Das Dokument daneben ist eine andere Tatsache aus einer anderen Quelle: ob an dieser Koordinate ein Sample existiert und wie unser eigener Lauf davon dort ausging.
- an dieser Koordinate noch kein Sample
- hier gibt es ein Sample, und wir haben es an dieser Koordinate noch nicht ausgeführt
- hier gibt es ein Sample, und unser Lauf an dieser Koordinate kam sauber zurück
- hier gibt es ein Sample, und unser Lauf an dieser Koordinate ist fehlgeschlagen
- hier gibt es ein Sample, und an dieser Koordinate sind ein bestandener und ein fehlgeschlagener Lauf verzeichnet
- nichts aufgezeichnet — unbekannt, weder „funktioniert“ noch „defekt“
- unter dieser Zelle liegt eine Ebene — zum Öffnen klicken
Ein Dokument bedeutet: An dieser Koordinate gibt es ein Sample. DASS es existiert, ist eine Aussage über diese Version und diese API und ändert sich nicht mit Betriebssystem, Runtime oder Paketmanager; seine FARBE sagt, wie dieses Sample in der Umgebung gelaufen ist, die Sie gerade ansehen.
Veröffentlichte Beispiele
- github.com/flynn/noise v1.0.0: CipherChaChaPoly Dieses Netzwerk bietet eine Sache: ein Sample, das baut. Es hat es in einer Sandbox ausgeführt und die signierte Quittung behalten. Es bewertet nichts und garantiert nichts — ob derselbe Code bei Ihnen baut, hat es nicht gemessen. HOWgithub.com/flynn/noise.CipherChaChaPoly MIT-0 · 2026-09-04
Kompatibilitätsmatrix
Beobachtungen auf Projektebene und Symbol-/Contract-Verifizierungen werden getrennt gezählt und niemals zusammengerechnet.
Diese Zahlen unterscheiden nicht, wie das Symbol aufgerufen wurde: Überladungen, Argumentformen und Optionen werden zusammengefasst. Was eine bestimmte Aufrufform tut, beweist der Vertrag eines Samples – nicht diese Zahlen.
| Umgebung | Konfidenz | Beobachtungen | Verifiziert | Erfolgsquote | Peers | Zuletzt gesehen |
|---|---|---|---|---|---|---|
| go 1.26 · Go · go · linux glibc · docker
Beobachtungen: PROJECT_TEST 1✓ — Verifiziert: CONTRACT 1✓
|
LOW | 1 | 1 | 100 % | 1 · 1✓ | 2026-09-17 |
| go 1.26 · Go · go · linux glibc
Beobachtungen: PROJECT_COMPILE 1✓ 1✕ · PROJECT_PROCESS 17✓
|
MEDIUM | 19 | 0 | 95 % | 2 | 2026-09-04 |
snapshot · 2026-09-17
Fehler-Cluster
-
beobachtet PROJECT_PROCESS ERR_ASSERTION Beweislücke ×6 v1.0.0 executionContext=node · moduleSystem=cjs · os=linux · runtime=node@22.23Beweisqualität: legacy-evidence-incomplete · Umgebungsvarianten: 1 · Zuerst erfasst: 2026-08-23 · Zuletzt gesehen: 2026-08-29Kandidat für diagnostische Neuprüfung
-
beobachtet UNKNOWN exit 1 Beweislücke ×4 v1.0.0 executionContext=node · moduleSystem=cjs · os=linux · runtime=node@22.23 sha256:91ad26545eb1…node:internal/modules/cjs/loader:<n> · throw err; · ^ · Error: Cannot find module <str>node · unclassified-diagnostic · outer node · gap stage-unknownBeweisqualität: complete · Umgebungsvarianten: 1 · Zuerst erfasst: 2026-08-30 · Zuletzt gesehen: 2026-08-30Kandidat für diagnostische Neuprüfung
-
beobachtet UNKNOWN exit 1 Beweislücke ×2 v1.0.0 executionContext=node · os=linux · runtime=node@22.23 sha256:9be950af9140…Traceback (most recent call last): · File <str>, line 1, in <module> · ModuleNotFoundError: No module named <str>python3 · unclassified-diagnostic · outer python3 · gap stage-unknownBeweisqualität: complete · Umgebungsvarianten: 2 · Zuerst erfasst: 2026-08-30 · Zuletzt gesehen: 2026-08-31Kandidat für diagnostische Neuprüfung
-
beobachtet UNKNOWN exit 1 Beweislücke ×2 v1.0.0 executionContext=node · moduleSystem=esm · os=linux · runtime=node@22.23 sha256:cc724e2e6a32…<path>:<n> · module.exports = require.addon() · ^ · TypeError: require.addon is not a functionnode · unclassified-diagnostic · outer node · gap stage-unknownBeweisqualität: complete · Umgebungsvarianten: 1 · Zuerst erfasst: 2026-08-30 · Zuletzt gesehen: 2026-08-31Kandidat für diagnostische Neuprüfung
-
beobachtet PROJECT_PROCESS exit 1 ERR_ASSERTION ×1 v1.0.0 executionContext=node · moduleSystem=cjs · os=linux · runtime=node@22.23 sha256:0e3b7c489c9f…node:internal/modules/run_main:<n> · triggerUncaughtException( · ^ · AssertionError [ERR_ASSERTION]: Expected values to be strictly deep-equal:Beweisqualität: complete · Umgebungsvarianten: 1 · Zuerst erfasst: 2026-08-29 · Zuletzt gesehen: 2026-08-29
-
beobachtet PROJECT_PROCESS exit 1 ERR_ASSERTION ×1 v1.0.0 executionContext=node · moduleSystem=cjs · os=linux · runtime=node@22.23 sha256:c209875bcbeb…node:internal/modules/run_main:<n> · triggerUncaughtException( · ^ …Beweisqualität: complete · Umgebungsvarianten: 1 · Zuerst erfasst: 2026-08-29 · Zuletzt gesehen: 2026-08-29
-
beobachtet PROJECT_PROCESS exit 1 ERR_MODULE_NOT_FOUND ×1 v1.0.0 executionContext=node · moduleSystem=cjs · os=linux · runtime=node@22.23 sha256:c33691aec18d…node:internal/modules/package_json_reader:<n> · throw new ERR_MODULE_NOT_FOUND(packageName, fileURLToPath(base), null); · ^ …Beweisqualität: complete · Umgebungsvarianten: 1 · Zuerst erfasst: 2026-08-29 · Zuletzt gesehen: 2026-08-29
-
beobachtet UNKNOWN exit 1 ERR_ASSERTION Beweislücke ×1 v1.0.0 executionContext=node · moduleSystem=esm · os=linux · runtime=node@22.23 sha256:10e769edac62…node:internal/modules/run_main:<n> · triggerUncaughtException( · ^ · AssertionError [ERR_ASSERTION]: The expression evaluated to a falsy value:node · unclassified-diagnostic · outer node · gap stage-unknownBeweisqualität: complete · Umgebungsvarianten: 1 · Zuerst erfasst: 2026-08-29 · Zuletzt gesehen: 2026-08-29Kandidat für diagnostische Neuprüfung
-
beobachtet UNKNOWN exit 1 ERR_ASSERTION Beweislücke ×1 v1.0.0 executionContext=node · moduleSystem=cjs · os=linux · runtime=node@22.23 sha256:07e974cf28d4…Test failed: AssertionError [ERR_ASSERTION]: getFeedURL should return configured feed url · + actual - expected · + <str> · - <str>node · unclassified-diagnostic · outer node · gap stage-unknownBeweisqualität: complete · Umgebungsvarianten: 1 · Zuerst erfasst: 2026-08-30 · Zuletzt gesehen: 2026-08-30Kandidat für diagnostische Neuprüfung
-
beobachtet UNKNOWN exit 1 Beweislücke ×1 v1.0.0 executionContext=node · moduleSystem=cjs · os=linux · runtime=node@22.23 sha256:1c03ca490615…Traceback (most recent call last): · File <str>, line 3, in <module> · AttributeError: module <str> has no attribute <str> · IANA_VERSION: <str>python · unclassified-diagnostic · outer python · gap stage-unknownBeweisqualität: complete · Umgebungsvarianten: 1 · Zuerst erfasst: 2026-08-30 · Zuletzt gesehen: 2026-08-30Kandidat für diagnostische Neuprüfung
-
beobachtet UNKNOWN exit 1 Beweislücke ×1 v1.0.0 executionContext=node · moduleSystem=cjs · os=linux · runtime=node@22.23 sha256:8310a83be884…node:internal/modules/cjs/loader:<n> · const err = new Error(message); · ^ · Error: Cannot find module <str>node · unclassified-diagnostic · outer node · gap stage-unknownBeweisqualität: complete · Umgebungsvarianten: 1 · Zuerst erfasst: 2026-08-30 · Zuletzt gesehen: 2026-08-30Kandidat für diagnostische Neuprüfung
-
beobachtet UNKNOWN exit 1 ERR_MODULE_NOT_FOUND Beweislücke ×1 v1.0.0 executionContext=node · moduleSystem=cjs · os=linux · runtime=node@22.23 sha256:88af852f99a8…node:internal/modules/package_json_reader:<n> · throw new ERR_MODULE_NOT_FOUND(packageName, fileURLToPath(base), null); · ^ …node · unclassified-diagnostic · outer node · gap stage-unknownBeweisqualität: complete · Umgebungsvarianten: 1 · Zuerst erfasst: 2026-08-30 · Zuletzt gesehen: 2026-08-30Kandidat für diagnostische Neuprüfung
Es werden die 12 meistgemeldeten von 23 aufgezeichneten Fehlerclustern gezeigt. Der Rest sind Einzelmeldungen.