记录cargounicode-ident1.0.27
更改条件
依赖健康度
某次解析读取了该版本的依赖树,没有发现依赖。这是一次测量结果,而不是缺失。
近期失败聚类
-
已观测 PROJECT_COMPILE exit 101 E0599 ×9 1.0.27 os=linux sha256:b07a18e8da2b…error[E0599]: no associated function or constant named `new` found for struct `Adapter` in the current scoperust/rustc · compiler-diagnostic · outer cargo build, cargo check, cargo run, cargo test证据质量: complete · 环境变体: 1 · 首次记录: 2026-10-19 · 最近观测: 2026-10-21
-
已观测 PROJECT_COMPILE exit 101 ×4 1.0.27 os=linux sha256:4c786cbbce8a…error: could not compile `sample` (bin <str>) due to 1 previous errorrust/rustc · compiler-diagnostic · outer cargo run证据质量: complete · 环境变体: 1 · 首次记录: 2026-10-21 · 最近观测: 2026-10-21
-
已观测 PROJECT_COMPILE exit 101 ×3 1.0.27 os=linux sha256:6d7f0ce8254c…error: could not compile `sample-idna-adapter` (bin <str>) due to 1 previous errorrust/rustc · compiler-diagnostic · outer cargo build, cargo check证据质量: complete · 环境变体: 1 · 首次记录: 2026-10-19 · 最近观测: 2026-10-21
-
已观测 PROJECT_COMPILE exit 101 E0308 ×2 1.0.25 → 1.0.27 os=linux sha256:0479254218ac…error[E0308]: mismatched typesrust/rustc · compiler-diagnostic · outer cargo run, cargo test证据质量: complete · 环境变体: 1 · 首次记录: 2026-09-16 · 最近观测: 2026-10-21
-
已观测 PROJECT_COMPILE exit 101 ×2 1.0.27 os=linux sha256:e461456111a7…error: could not compile `sample-zerocopy-immutable` (bin <str>) due to 1 previous errorrust/rustc · compiler-diagnostic · outer cargo run证据质量: complete · 环境变体: 1 · 首次记录: 2026-10-16 · 最近观测: 2026-10-16
-
已观测 UNKNOWN exit 101 证据缺口 ×2 1.0.27 os=linux sha256:0a082b31ba29…Updating crates.io index · Locking 6 packages to latest compatible versions · Adding zerocopy v0.8.62 (available: v0.8.63) …cargo · unclassified-diagnostic · outer cargo run · gap stage-unknown证据质量: complete · 环境变体: 1 · 首次记录: 2026-10-16 · 最近观测: 2026-10-16诊断复验候选
-
已观测 UNKNOWN exit 101 证据缺口 ×2 1.0.27 os=linux sha256:8f78f52362b8…Updating crates.io index · Locking 7 packages to latest compatible versions · Adding wasm-bindgen-macro-support v0.2.128 (available: v0.2.129) …cargo · unclassified-diagnostic · outer cargo run · gap stage-unknown证据质量: complete · 环境变体: 1 · 首次记录: 2026-10-17 · 最近观测: 2026-10-17诊断复验候选
-
已观测 PROJECT_TEST exit 101 ×2 1.0.27 os=linux sha256:4f232600c5a8…error: test failed, to rerun pass `--test contract` · running 0 tests …rust/test · test-runner-diagnostic · outer cargo test证据质量: complete · 环境变体: 1 · 首次记录: 2026-10-18 · 最近观测: 2026-10-18
-
已观测 PROJECT_COMPILE exit 101 E0599 ×1 1.0.27 os=linux sha256:259d35925fd1…error[E0599]: no associated function or constant named `new_zeroed` found for struct `Header` in the current scoperust/rustc · compiler-diagnostic · outer cargo test证据质量: complete · 环境变体: 1 · 首次记录: 2026-10-16 · 最近观测: 2026-10-16
-
已观测 PROJECT_COMPILE exit 101 ×1 1.0.27 os=linux sha256:623172eb9244…error: could not compile `sample` (bin <str> test) due to 1 previous errorrust/rustc · compiler-diagnostic · outer cargo test证据质量: complete · 环境变体: 1 · 首次记录: 2026-10-16 · 最近观测: 2026-10-16
-
已观测 PROJECT_COMPILE exit 101 E0505 ×1 1.0.27 os=linux sha256:cbcd51a513e3…error[E0505]: cannot move out of `header` because it is borrowedrust/rustc · compiler-diagnostic · outer cargo run证据质量: complete · 环境变体: 1 · 首次记录: 2026-10-16 · 最近观测: 2026-10-16
-
已观测 PROJECT_COMPILE exit 101 E0277 ×1 1.0.27 os=linux sha256:e5387c1d1a4b…error[E0277]: the trait bound `T: KnownLayout` is not satisfiedrust/rustc · compiler-diagnostic · outer cargo run证据质量: complete · 环境变体: 1 · 首次记录: 2026-10-16 · 最近观测: 2026-10-16
显示报告最多的 12 个。此坐标记录的失败聚类共 36 个。其余为单次报告。