記録cargounicode-ident1.0.27
条件を変更
依存関係のヘルス
ある解決処理がこのリリースのツリーを読み、依存関係はありませんでした。欠落ではなく測定結果です。
最近の失敗クラスター
-
観測済み PROJECT_COMPILE exit 101 ×2 1.0.27 os=linux sha256:e461456111a7…error: could not compile `sample-zerocopy-immutable` (bin <str>) due to 1 previous errorrust/rustc · compiler-diagnostic · outer cargo run証拠品質: complete · 環境バリアント: 1 · 初回記録: 2026-10-16 · 最終観測: 2026-10-16
-
観測済み UNKNOWN exit 101 証拠の欠落 ×2 1.0.27 os=linux sha256:0a082b31ba29…Updating crates.io index · Locking 6 packages to latest compatible versions · Adding zerocopy v0.8.62 (available: v0.8.63) …cargo · unclassified-diagnostic · outer cargo run · gap stage-unknown証拠品質: complete · 環境バリアント: 1 · 初回記録: 2026-10-16 · 最終観測: 2026-10-16診断再検証候補
-
観測済み UNKNOWN exit 101 証拠の欠落 ×2 1.0.27 os=linux sha256:8f78f52362b8…Updating crates.io index · Locking 7 packages to latest compatible versions · Adding wasm-bindgen-macro-support v0.2.128 (available: v0.2.129) …cargo · unclassified-diagnostic · outer cargo run · gap stage-unknown証拠品質: complete · 環境バリアント: 1 · 初回記録: 2026-10-17 · 最終観測: 2026-10-17診断再検証候補
-
観測済み PROJECT_TEST exit 101 ×2 1.0.27 os=linux sha256:4f232600c5a8…error: test failed, to rerun pass `--test contract` · running 0 tests …rust/test · test-runner-diagnostic · outer cargo test証拠品質: complete · 環境バリアント: 1 · 初回記録: 2026-10-18 · 最終観測: 2026-10-18
-
観測済み PROJECT_COMPILE exit 101 E0599 ×1 1.0.27 os=linux sha256:259d35925fd1…error[E0599]: no associated function or constant named `new_zeroed` found for struct `Header` in the current scoperust/rustc · compiler-diagnostic · outer cargo test証拠品質: complete · 環境バリアント: 1 · 初回記録: 2026-10-16 · 最終観測: 2026-10-16
-
観測済み PROJECT_COMPILE exit 101 ×1 1.0.27 os=linux sha256:623172eb9244…error: could not compile `sample` (bin <str> test) due to 1 previous errorrust/rustc · compiler-diagnostic · outer cargo test証拠品質: complete · 環境バリアント: 1 · 初回記録: 2026-10-16 · 最終観測: 2026-10-16
-
観測済み PROJECT_COMPILE exit 101 E0505 ×1 1.0.27 os=linux sha256:cbcd51a513e3…error[E0505]: cannot move out of `header` because it is borrowedrust/rustc · compiler-diagnostic · outer cargo run証拠品質: complete · 環境バリアント: 1 · 初回記録: 2026-10-16 · 最終観測: 2026-10-16
-
観測済み PROJECT_COMPILE exit 101 E0277 ×1 1.0.27 os=linux sha256:e5387c1d1a4b…error[E0277]: the trait bound `T: KnownLayout` is not satisfiedrust/rustc · compiler-diagnostic · outer cargo run証拠品質: complete · 環境バリアント: 1 · 初回記録: 2026-10-16 · 最終観測: 2026-10-16
-
観測済み PROJECT_COMPILE exit 101 E0599 ×1 1.0.27 os=linux sha256:0d0e9d01775d…error[E0599]: no method named `zero` found for struct `PacketHeader` in the current scoperust/rustc · compiler-diagnostic · outer cargo run証拠品質: complete · 環境バリアント: 1 · 初回記録: 2026-10-16 · 最終観測: 2026-10-16
-
観測済み PROJECT_COMPILE exit 101 E0277 ×1 1.0.27 os=linux sha256:0f9e25b7a406…error[E0277]: the trait bound `PacketHeader: FromBytes` is not satisfiedrust/rustc · compiler-diagnostic · outer cargo run証拠品質: complete · 環境バリアント: 1 · 初回記録: 2026-10-16 · 最終観測: 2026-10-16
-
観測済み PROJECT_COMPILE exit 101 ×1 1.0.27 os=linux sha256:36117b64532a…error: could not compile `sample-zerocopy-intobytes` (bin <str>) due to 2 previous errorsrust/rustc · compiler-diagnostic · outer cargo run証拠品質: complete · 環境バリアント: 1 · 初回記録: 2026-10-16 · 最終観測: 2026-10-16
-
観測済み PROJECT_COMPILE exit 101 ×1 1.0.27 os=linux sha256:413e0f6a3ea0…error: could not compile `sample-zerocopy-frombytes` (bin <str>) due to 2 previous errorsrust/rustc · compiler-diagnostic · outer cargo run証拠品質: complete · 環境バリアント: 1 · 初回記録: 2026-10-16 · 最終観測: 2026-10-16
最も多く報告された 12 件を表示しています。この座標に記録された失敗クラスタは 26 件です。残りは単発の報告です。