Recordscargounicode-ident1.0.25
Change the conditions
Current conditions
unicode-ident @1.0.25ubuntu glibc · x64 · cargo 1
package-level total, not an API
8 of 11 passed
Observed — real project builds reported from this coordinate.
no sample at this coordinate yet
- Project observations
- 8 / 11
- Contract verifications
- nothing at this coordinate
- Independent reporting peers
- 1
- Last recorded
- 2026-09-17
Evidence you can open
Dependency Health
A resolution read this release's tree and found no dependencies. That is a measurement, not a missing one.
Recent failure clusters
-
observed PROJECT_COMPILE exit 101 E0308 ×1 1.0.25 os=linux sha256:0479254218ac…error[E0308]: mismatched typesrust/rustc · compiler-diagnostic · outer cargo testEvidence quality: complete · Environment variants: 1 · First recorded: 2026-09-16 · Last seen: 2026-09-16
-
observed PROJECT_COMPILE exit 101 E0433 ×1 1.0.25 os=linux sha256:76da7807743b…error[E0433]: cannot find `pin` in `tokio` · error[E0433]: cannot find `pin` in `tokio_macros_sample`rust/rustc · compiler-diagnostic · outer cargo testEvidence quality: complete · Environment variants: 1 · First recorded: 2026-09-16 · Last seen: 2026-09-16
-
observed PROJECT_COMPILE exit 101 ×1 1.0.25 os=linux sha256:ddfcd6108cf7…error: could not compile `tokio_macros_sample` (test <str>) due to 6 previous errorsrust/rustc · compiler-diagnostic · outer cargo testEvidence quality: complete · Environment variants: 1 · First recorded: 2026-09-16 · Last seen: 2026-09-16