Записиcargounicode-ident1.0.24unicode_ident::is_xid_continue
Изменить условия
Текущие условия
unicode_ident::is_xid_continue @1.0.24ubuntu glibc · x64 · cargo 1
1 из 1 прошли
Наблюдение — реальные сборки проектов сообщили об этой координате.
образец есть — в этой координате мы его ещё не запускали (1)
- Наблюдения в проектах
- 1 / 1
- Проверки контрактом
- в этой координате ничего
- Независимые сообщившие пиры
- 1
- Последняя запись
- 2026-09-14
Свидетельства, которые можно открыть
Здоровье зависимостей
Разрешение прочитало дерево этого релиза и не нашло зависимостей. Это измерение, а не его отсутствие.
Недавние кластеры сбоев
-
наблюдалось PROJECT_COMPILE exit 101 ×1 1.0.24 os=linux sha256:0d5a8e2ccc86…error: could not compile `quote-test` (bin <str>) due to 1 previous error; 1 warning emittedrust/rustc · compiler-diagnostic · outer cargo runКачество данных: complete · Варианты среды: 1 · Первая запись: 2026-09-14 · Последнее наблюдение: 2026-09-14
-
наблюдалось PROJECT_COMPILE exit 101 E0432 ×1 1.0.24 os=linux sha256:4a6dd64b7a9b…error[E0432]: unresolved import `proc_macro2`rust/rustc · compiler-diagnostic · outer cargo testКачество данных: complete · Варианты среды: 1 · Первая запись: 2026-09-14 · Последнее наблюдение: 2026-09-14
-
наблюдалось PROJECT_COMPILE exit 101 E0277 ×1 1.0.24 os=linux sha256:ab12e03ad4b1…error[E0277]: the trait bound `i32: IdentFragment` is not satisfiedrust/rustc · compiler-diagnostic · outer cargo runКачество данных: complete · Варианты среды: 1 · Первая запись: 2026-09-14 · Последнее наблюдение: 2026-09-14
-
наблюдалось PROJECT_COMPILE exit 101 ×1 1.0.24 os=linux sha256:b53ce471a520…error: could not compile `test-quote` (lib) due to 1 previous error; 1 warning emittedrust/rustc · compiler-diagnostic · outer cargo testКачество данных: complete · Варианты среды: 1 · Первая запись: 2026-09-14 · Последнее наблюдение: 2026-09-14
-
наблюдалось PROJECT_TEST exit 101 ×1 1.0.24 os=linux sha256:cc325a11570b…error: test failed, to rerun pass `--lib` · running 6 tests · test tests::test_quote_basic_tokens ... ok …rust/test · test-runner-diagnostic · outer cargo testКачество данных: complete · Варианты среды: 1 · Первая запись: 2026-09-14 · Последнее наблюдение: 2026-09-14
-
наблюдалось PROJECT_COMPILE exit 101 E0433 ×1 1.0.24 os=linux sha256:4cea35867957…error[E0433]: cannot find `__private229` in `_serde` · error[E0433]: cannot find `Serializer` in `_serde` · error[E0433]: cannot find `ser` in `_serde`rust/rustc · compiler-diagnostic · outer cargo checkКачество данных: complete · Варианты среды: 1 · Первая запись: 2026-09-14 · Последнее наблюдение: 2026-09-14
-
наблюдалось PROJECT_COMPILE exit 101 E0283 ×1 1.0.24 os=linux sha256:55052d6fc8b2…error[E0283]: type annotations neededrust/rustc · compiler-diagnostic · outer cargo runКачество данных: complete · Варианты среды: 1 · Первая запись: 2026-09-14 · Последнее наблюдение: 2026-09-14
-
наблюдалось PROJECT_COMPILE exit 101 ×1 1.0.24 os=linux sha256:7461bf46226d…error: could not compile `sample-serde-core` (bin <str>) due to 3 previous errorsrust/rustc · compiler-diagnostic · outer cargo runКачество данных: complete · Варианты среды: 1 · Первая запись: 2026-09-14 · Последнее наблюдение: 2026-09-14
-
наблюдалось PROJECT_COMPILE exit 101 E0405 ×1 1.0.24 os=linux sha256:8a1088019b07…error[E0405]: cannot find trait `Serialize` in module `_serde` · error[E0405]: cannot find trait `Serializer` in module `_serde`rust/rustc · compiler-diagnostic · outer cargo checkКачество данных: complete · Варианты среды: 1 · Первая запись: 2026-09-14 · Последнее наблюдение: 2026-09-14
-
наблюдалось PROJECT_COMPILE exit 101 ×1 1.0.24 os=linux sha256:b21c095b1aba…error: could not compile `sample-serde-core` (bin <str>) due to 1 previous errorrust/rustc · compiler-diagnostic · outer cargo runКачество данных: complete · Варианты среды: 1 · Первая запись: 2026-09-14 · Последнее наблюдение: 2026-09-14
-
наблюдалось PROJECT_COMPILE exit 101 ×1 1.0.24 os=linux sha256:df160d9ca814…error: could not compile `sample-serde-derive` (bin <str>) due to 7 previous errorsrust/rustc · compiler-diagnostic · outer cargo checkКачество данных: complete · Варианты среды: 1 · Первая запись: 2026-09-14 · Последнее наблюдение: 2026-09-14
-
наблюдалось PROJECT_COMPILE exit 101 E0599 ×1 1.0.24 os=linux sha256:f713b890152f…error[E0599]: no method named `into_deserializer` found for enum `std::option::Option<T>` in the current scope …rust/rustc · compiler-diagnostic · outer cargo runКачество данных: complete · Варианты среды: 1 · Первая запись: 2026-09-14 · Последнее наблюдение: 2026-09-14
Показаны 12 наиболее часто сообщаемых из 15 записанных кластеров отказов. Остальные — единичные сообщения.