Registroscargounicode-ident1.0.25
Cambiar las condiciones
Condiciones actuales
unicode-ident @1.0.25ubuntu glibc · x64 · cargo 1
total del paquete, no una API
8 de 11 pasaron
Observado: builds reales de proyectos reportaron desde esta coordenada.
todavía no hay muestra en esta coordenada
- Observaciones de proyectos
- 8 / 11
- Verificaciones de contrato
- nada en esta coordenada
- Peers independientes que reportaron
- 1
- Último registro
- 2026-09-17
Evidencia que puedes abrir
Salud de dependencias
Una resolución leyó el árbol de esta versión y no encontró dependencias. Es una medición, no una que falte.
Clústeres de fallos recientes
-
observado PROJECT_COMPILE exit 101 E0308 ×1 1.0.25 os=linux sha256:0479254218ac…error[E0308]: mismatched typesrust/rustc · compiler-diagnostic · outer cargo testCalidad de evidencia: complete · Variantes de entorno: 1 · Primer registro: 2026-09-16 · Última observación: 2026-09-16
-
observado PROJECT_COMPILE exit 101 E0433 ×1 1.0.25 os=linux sha256:76da7807743b…error[E0433]: cannot find `pin` in `tokio` · error[E0433]: cannot find `pin` in `tokio_macros_sample`rust/rustc · compiler-diagnostic · outer cargo testCalidad de evidencia: complete · Variantes de entorno: 1 · Primer registro: 2026-09-16 · Última observación: 2026-09-16
-
observado PROJECT_COMPILE exit 101 ×1 1.0.25 os=linux sha256:ddfcd6108cf7…error: could not compile `tokio_macros_sample` (test <str>) due to 6 previous errorsrust/rustc · compiler-diagnostic · outer cargo testCalidad de evidencia: complete · Variantes de entorno: 1 · Primer registro: 2026-09-16 · Última observación: 2026-09-16