기록cargounicode-ident1.0.24unicode_ident::is_xid_continue
조건 변경
현재 조건
unicode_ident::is_xid_continue @1.0.24ubuntu glibc · x64 · cargo 1
1회 중 1회 통과
관측 — 실제 프로젝트 빌드가 이 좌표에서 보고되었습니다.
샘플 있음 — 이 좌표에서는 아직 우리가 실행하지 않음 (1)
- 프로젝트 관측
- 1 / 1
- 컨트랙트 검증
- 이 좌표에는 없음
- 독립 보고 peer
- 1
- 마지막 기록
- 2026-09-14
열어 볼 수 있는 증거
의존성 건강도
어떤 해결 과정이 이 릴리스의 트리를 읽었고 의존성이 없었습니다. 빠진 것이 아니라 측정된 것입니다.
최근 실패 클러스터
-
관측됨 PROJECT_COMPILE exit 101 ×1 1.0.24 os=linux sha256:0d5a8e2ccc86…error: could not compile `quote-test` (bin <str>) due to 1 previous error; 1 warning emittedrust/rustc · compiler-diagnostic · outer cargo run증거 품질: complete · 환경 변형: 1 · 최초 관측: 2026-09-14 · 마지막 관측: 2026-09-14
-
관측됨 PROJECT_COMPILE exit 101 E0432 ×1 1.0.24 os=linux sha256:4a6dd64b7a9b…error[E0432]: unresolved import `proc_macro2`rust/rustc · compiler-diagnostic · outer cargo test증거 품질: complete · 환경 변형: 1 · 최초 관측: 2026-09-14 · 마지막 관측: 2026-09-14
-
관측됨 PROJECT_COMPILE exit 101 E0277 ×1 1.0.24 os=linux sha256:ab12e03ad4b1…error[E0277]: the trait bound `i32: IdentFragment` is not satisfiedrust/rustc · compiler-diagnostic · outer cargo run증거 품질: complete · 환경 변형: 1 · 최초 관측: 2026-09-14 · 마지막 관측: 2026-09-14
-
관측됨 PROJECT_COMPILE exit 101 ×1 1.0.24 os=linux sha256:b53ce471a520…error: could not compile `test-quote` (lib) due to 1 previous error; 1 warning emittedrust/rustc · compiler-diagnostic · outer cargo test증거 품질: complete · 환경 변형: 1 · 최초 관측: 2026-09-14 · 마지막 관측: 2026-09-14
-
관측됨 PROJECT_TEST exit 101 ×1 1.0.24 os=linux sha256:cc325a11570b…error: test failed, to rerun pass `--lib` · running 6 tests · test tests::test_quote_basic_tokens ... ok …rust/test · test-runner-diagnostic · outer cargo test증거 품질: complete · 환경 변형: 1 · 최초 관측: 2026-09-14 · 마지막 관측: 2026-09-14
-
관측됨 PROJECT_COMPILE exit 101 E0433 ×1 1.0.24 os=linux sha256:4cea35867957…error[E0433]: cannot find `__private229` in `_serde` · error[E0433]: cannot find `Serializer` in `_serde` · error[E0433]: cannot find `ser` in `_serde`rust/rustc · compiler-diagnostic · outer cargo check증거 품질: complete · 환경 변형: 1 · 최초 관측: 2026-09-14 · 마지막 관측: 2026-09-14
-
관측됨 PROJECT_COMPILE exit 101 E0283 ×1 1.0.24 os=linux sha256:55052d6fc8b2…error[E0283]: type annotations neededrust/rustc · compiler-diagnostic · outer cargo run증거 품질: complete · 환경 변형: 1 · 최초 관측: 2026-09-14 · 마지막 관측: 2026-09-14
-
관측됨 PROJECT_COMPILE exit 101 ×1 1.0.24 os=linux sha256:7461bf46226d…error: could not compile `sample-serde-core` (bin <str>) due to 3 previous errorsrust/rustc · compiler-diagnostic · outer cargo run증거 품질: complete · 환경 변형: 1 · 최초 관측: 2026-09-14 · 마지막 관측: 2026-09-14
-
관측됨 PROJECT_COMPILE exit 101 E0405 ×1 1.0.24 os=linux sha256:8a1088019b07…error[E0405]: cannot find trait `Serialize` in module `_serde` · error[E0405]: cannot find trait `Serializer` in module `_serde`rust/rustc · compiler-diagnostic · outer cargo check증거 품질: complete · 환경 변형: 1 · 최초 관측: 2026-09-14 · 마지막 관측: 2026-09-14
-
관측됨 PROJECT_COMPILE exit 101 ×1 1.0.24 os=linux sha256:b21c095b1aba…error: could not compile `sample-serde-core` (bin <str>) due to 1 previous errorrust/rustc · compiler-diagnostic · outer cargo run증거 품질: complete · 환경 변형: 1 · 최초 관측: 2026-09-14 · 마지막 관측: 2026-09-14
-
관측됨 PROJECT_COMPILE exit 101 ×1 1.0.24 os=linux sha256:df160d9ca814…error: could not compile `sample-serde-derive` (bin <str>) due to 7 previous errorsrust/rustc · compiler-diagnostic · outer cargo check증거 품질: complete · 환경 변형: 1 · 최초 관측: 2026-09-14 · 마지막 관측: 2026-09-14
-
관측됨 PROJECT_COMPILE exit 101 E0599 ×1 1.0.24 os=linux sha256:f713b890152f…error[E0599]: no method named `into_deserializer` found for enum `std::option::Option<T>` in the current scope …rust/rustc · compiler-diagnostic · outer cargo run증거 품질: complete · 환경 변형: 1 · 최초 관측: 2026-09-14 · 마지막 관측: 2026-09-14
가장 많이 보고된 12개를 보여줍니다. 이 좌표에 기록된 실패 클러스터는 15개입니다. 나머지는 단발 보고입니다.