Relevéscargounicode-ident1.0.24unicode_ident::UNICODE_VERSION
Changer les conditions
Conditions actuelles
unicode_ident::UNICODE_VERSION @1.0.24ubuntu glibc · x64 · cargo 1
1 sur 1 ont réussi
Observé — de vrais builds de projets ont fait remonter cette coordonnée.
il y a un échantillon ici et nous ne l'avons pas encore exécuté à cette coordonnée (1)
- Observations de projets
- 1 / 1
- Vérifications de contrat
- rien à cette coordonnée
- Pairs rapporteurs indépendants
- 1
- Dernier enregistrement
- 2026-09-14
Preuves que vous pouvez ouvrir
Santé des dépendances
Une résolution a lu l'arbre de cette version et n'a trouvé aucune dépendance. C'est une mesure, pas une mesure manquante.
Clusters d'échecs récents
-
observé PROJECT_COMPILE exit 101 ×1 1.0.24 os=linux sha256:0d5a8e2ccc86…error: could not compile `quote-test` (bin <str>) due to 1 previous error; 1 warning emittedrust/rustc · compiler-diagnostic · outer cargo runQualité de preuve: complete · Variantes d’environnement: 1 · Premier relevé: 2026-09-14 · Dernière observation: 2026-09-14
-
observé PROJECT_COMPILE exit 101 E0432 ×1 1.0.24 os=linux sha256:4a6dd64b7a9b…error[E0432]: unresolved import `proc_macro2`rust/rustc · compiler-diagnostic · outer cargo testQualité de preuve: complete · Variantes d’environnement: 1 · Premier relevé: 2026-09-14 · Dernière observation: 2026-09-14
-
observé PROJECT_COMPILE exit 101 E0277 ×1 1.0.24 os=linux sha256:ab12e03ad4b1…error[E0277]: the trait bound `i32: IdentFragment` is not satisfiedrust/rustc · compiler-diagnostic · outer cargo runQualité de preuve: complete · Variantes d’environnement: 1 · Premier relevé: 2026-09-14 · Dernière observation: 2026-09-14
-
observé PROJECT_COMPILE exit 101 ×1 1.0.24 os=linux sha256:b53ce471a520…error: could not compile `test-quote` (lib) due to 1 previous error; 1 warning emittedrust/rustc · compiler-diagnostic · outer cargo testQualité de preuve: complete · Variantes d’environnement: 1 · Premier relevé: 2026-09-14 · Dernière observation: 2026-09-14
-
observé PROJECT_TEST exit 101 ×1 1.0.24 os=linux sha256:cc325a11570b…error: test failed, to rerun pass `--lib` · running 6 tests · test tests::test_quote_basic_tokens ... ok …rust/test · test-runner-diagnostic · outer cargo testQualité de preuve: complete · Variantes d’environnement: 1 · Premier relevé: 2026-09-14 · Dernière observation: 2026-09-14
-
observé PROJECT_COMPILE exit 101 E0433 ×1 1.0.24 os=linux sha256:4cea35867957…error[E0433]: cannot find `__private229` in `_serde` · error[E0433]: cannot find `Serializer` in `_serde` · error[E0433]: cannot find `ser` in `_serde`rust/rustc · compiler-diagnostic · outer cargo checkQualité de preuve: complete · Variantes d’environnement: 1 · Premier relevé: 2026-09-14 · Dernière observation: 2026-09-14
-
observé PROJECT_COMPILE exit 101 E0283 ×1 1.0.24 os=linux sha256:55052d6fc8b2…error[E0283]: type annotations neededrust/rustc · compiler-diagnostic · outer cargo runQualité de preuve: complete · Variantes d’environnement: 1 · Premier relevé: 2026-09-14 · Dernière observation: 2026-09-14
-
observé PROJECT_COMPILE exit 101 ×1 1.0.24 os=linux sha256:7461bf46226d…error: could not compile `sample-serde-core` (bin <str>) due to 3 previous errorsrust/rustc · compiler-diagnostic · outer cargo runQualité de preuve: complete · Variantes d’environnement: 1 · Premier relevé: 2026-09-14 · Dernière observation: 2026-09-14
-
observé PROJECT_COMPILE exit 101 E0405 ×1 1.0.24 os=linux sha256:8a1088019b07…error[E0405]: cannot find trait `Serialize` in module `_serde` · error[E0405]: cannot find trait `Serializer` in module `_serde`rust/rustc · compiler-diagnostic · outer cargo checkQualité de preuve: complete · Variantes d’environnement: 1 · Premier relevé: 2026-09-14 · Dernière observation: 2026-09-14
-
observé PROJECT_COMPILE exit 101 ×1 1.0.24 os=linux sha256:b21c095b1aba…error: could not compile `sample-serde-core` (bin <str>) due to 1 previous errorrust/rustc · compiler-diagnostic · outer cargo runQualité de preuve: complete · Variantes d’environnement: 1 · Premier relevé: 2026-09-14 · Dernière observation: 2026-09-14
-
observé PROJECT_COMPILE exit 101 ×1 1.0.24 os=linux sha256:df160d9ca814…error: could not compile `sample-serde-derive` (bin <str>) due to 7 previous errorsrust/rustc · compiler-diagnostic · outer cargo checkQualité de preuve: complete · Variantes d’environnement: 1 · Premier relevé: 2026-09-14 · Dernière observation: 2026-09-14
-
observé PROJECT_COMPILE exit 101 E0599 ×1 1.0.24 os=linux sha256:f713b890152f…error[E0599]: no method named `into_deserializer` found for enum `std::option::Option<T>` in the current scope …rust/rustc · compiler-diagnostic · outer cargo runQualité de preuve: complete · Variantes d’environnement: 1 · Premier relevé: 2026-09-14 · Dernière observation: 2026-09-14
Affichage des 12 plus signalés parmi 15 groupes d’échecs enregistrés. Le reste sont des signalements uniques.