Aufzeichnungencargotokio1.53.1axum::debug_handler
Bedingungen ändern
Aktuelle Bedingungen
axum::debug_handler @1.53.1alpine musl · x64 · rust 1 · cargo · rust
2 von 3 bestanden
Verifiziert — dieses Netzwerk hat an dieser Koordinate einen Contract ausgeführt.
hier gibt es ein Sample, und an dieser Koordinate sind ein bestandener und ein fehlgeschlagener Lauf verzeichnet (1)
- Projektbeobachtungen
- nichts an dieser Koordinate
- Contract-Verifikationen
- 2 / 3
- Gegengeprüft
- von zwei oder mehr unabhängigen Peers reproduziert
- Zuletzt erfasst
- 2026-09-15
Abhängigkeits-Zustand
Beobachtete Kombinationen und Fehlernachweise für dieses Release
Erster beobachteter Fehler
1.53.1
linux · rust@1 · executionContext=rust
2 FAIL · stage: PROJECT_TEST
| Bibliothek | Version | Zustand | Dort gemessen | Projekte |
|---|---|---|---|---|
| mio | 1.2.2 | CANDIDATE Korrelierte Änderung; unbewiesene Kombination | Contract bestanden | 6 Projekttage |
| mio | 1.2.3 | CANDIDATE Korrelierte Änderung; unbewiesene Kombination | Builds beobachtet | 2 Projekttage |
| socket2 | 0.6.5 | CANDIDATE Korrelierte Änderung; unbewiesene Kombination | Contract bestanden | 8 Projekttage |
| tokio-macros | 2.7.2 | CANDIDATE Korrelierte Änderung; unbewiesene Kombination | Contract bestanden | 10 Projekttage |
| windows-sys | 0.61.2 | CANDIDATE Korrelierte Änderung; unbewiesene Kombination | Contract bestanden | 8 Projekttage |
| bytes | 1.12.1 | PASS Alle Beobachtungen bestanden | Contract bestanden | 5 Projekttage |
| libc | 0.2.189 | PASS Alle Beobachtungen bestanden | Contract bestanden | 8 Projekttage |
| pin-project-lite | 0.2.17 | PASS Alle Beobachtungen bestanden | Contract bestanden | 20 Projekttage |
Die Messspalte betrifft das Release der jeweiligen Abhängigkeit selbst, nicht das Paar. Dass ein Resolver zwei Releases nebeneinandergestellt hat, ist kein Beleg dafür, dass sie zusammen funktionieren.
Abhängigkeitsversionen über Releases
Worauf jedes Release dieses Pakets seine Kinder aufgelöst hat. Ein Kind, dessen Version sich bewegt hat, steht zuerst: dort hat ein Upgrade etwas unter Ihnen verändert.
| Bibliothek | 1.53.1 | 1.43.0 |
|---|---|---|
| mio | 1.2.3 | 1.2.2 |
| socket2 | 0.6.5 | 0.5.10 |
| tokio-macros | 2.7.2 | 2.5.0 |
| windows-sys | 0.61.2 | 0.52.0 |
| backtrace | — | 0.3.76 |
| bytes | 1.12.1 | 1.12.1 |
| libc | 0.2.189 | 0.2.189 |
| pin-project-lite | 0.2.17 | 0.2.17 |
Bewegt: 4 · in jedem Release gleich: 4
Eine Kante hält fest, dass ein Resolver auf einer echten Maschine ein Release neben ein anderes gestellt hat. Sie behauptet nicht, dass beide zusammen funktionieren; diese Frage beantworten Samples und Contracts, nicht das Vorhandensein einer Zeile.
Aktuelle Fehler-Cluster
-
beobachtet PROJECT_TEST Beweislücke ×2 1.43.0 → 1.53.1 executionContext=rust · os=linux · runtime=rust@1Beweisqualität: legacy-evidence-incomplete · Umgebungsvarianten: 1 · Zuerst erfasst: 2026-09-08 · Zuletzt gesehen: 2026-09-08Kandidat für diagnostische Neuprüfung
-
beobachtet PROJECT_COMPILE exit 101 ×2 1.53.1 os=linux sha256:a67fd218023f…error: could not compile `test-hyper-util` (bin <str>) due to 1 previous errorrust/rustc · compiler-diagnostic · outer cargo runBeweisqualität: complete · Umgebungsvarianten: 1 · Zuerst erfasst: 2026-09-19 · Zuletzt gesehen: 2026-09-19
-
beobachtet PROJECT_COMPILE exit 101 ×1 1.53.1 os=linux sha256:1043b6df5638…error: could not compile `test-hyper-util` (bin <str>) due to 1 previous error; 1 warning emittedrust/rustc · compiler-diagnostic · outer cargo checkBeweisqualität: complete · Umgebungsvarianten: 1 · Zuerst erfasst: 2026-09-19 · Zuletzt gesehen: 2026-09-19
-
beobachtet PROJECT_COMPILE exit 101 E0624 ×1 1.53.1 os=linux sha256:65fda95c6b71…error[E0624]: method `remaining` is privaterust/rustc · compiler-diagnostic · outer cargo runBeweisqualität: complete · Umgebungsvarianten: 1 · Zuerst erfasst: 2026-09-19 · Zuletzt gesehen: 2026-09-19
-
beobachtet PROJECT_COMPILE exit 101 E0599 ×1 1.53.1 os=linux sha256:689d8da7053d…error[E0599]: no method named `http1_only` found for mutable reference `&mut hyper_util::client::legacy::Builder` in the current scoperust/rustc · compiler-diagnostic · outer cargo runBeweisqualität: complete · Umgebungsvarianten: 1 · Zuerst erfasst: 2026-09-19 · Zuletzt gesehen: 2026-09-19
-
beobachtet PROJECT_COMPILE exit 101 E0433 ×1 1.53.1 os=linux sha256:b3ae21627e63…error[E0433]: cannot find module or crate `tokio` in this scoperust/rustc · compiler-diagnostic · outer cargo checkBeweisqualität: complete · Umgebungsvarianten: 1 · Zuerst erfasst: 2026-09-19 · Zuletzt gesehen: 2026-09-19
-
beobachtet PROJECT_COMPILE exit 101 E0432 ×1 1.53.1 os=linux sha256:cce7c6259bba…error[E0432]: unresolved imports `hyper_util::rt::WithHyperIo`, `hyper_util::rt::WithTokioIo`rust/rustc · compiler-diagnostic · outer cargo checkBeweisqualität: complete · Umgebungsvarianten: 1 · Zuerst erfasst: 2026-09-19 · Zuletzt gesehen: 2026-09-19
-
beobachtet PROJECT_COMPILE exit 101 ×1 1.53.1 os=linux sha256:ec2184db47b8…error: could not compile `sample-hyper` (bin <str>) due to 5 previous errors; 1 warning emittedrust/rustc · compiler-diagnostic · outer cargo runBeweisqualität: complete · Umgebungsvarianten: 1 · Zuerst erfasst: 2026-09-19 · Zuletzt gesehen: 2026-09-19