Registroscargotokio1.53.1
Mudar as condições
Condições atuais
tokio @1.53.1ubuntu glibc · x64 · cargo 1
total do pacote, não uma API
12 de 20 passaram
Observado — builds reais de projetos reportaram desta coordenada.
há uma amostra aqui e ainda não a executamos nesta coordenada (8)
- Observações de projetos
- 12 / 20
- Verificações de contrato
- nada nesta coordenada
- Peers independentes que reportaram
- 1
- Último registro
- 2026-09-20
Saúde das dependências
Combinações observadas e evidências de falha para esta versão
Primeira quebra observada
1.53.1
linux · rust@1 · executionContext=rust
2 FAIL · stage: PROJECT_TEST
| Biblioteca | Versão | Saúde | Medido ali | Projetos |
|---|---|---|---|---|
| mio | 1.2.2 | CANDIDATE Mudança correlacionada; combinação não comprovada | contrato aprovado | 6 dias-projeto |
| mio | 1.2.3 | CANDIDATE Mudança correlacionada; combinação não comprovada | builds observados | 2 dias-projeto |
| socket2 | 0.6.5 | CANDIDATE Mudança correlacionada; combinação não comprovada | contrato aprovado | 8 dias-projeto |
| tokio-macros | 2.7.2 | CANDIDATE Mudança correlacionada; combinação não comprovada | contrato aprovado | 10 dias-projeto |
| windows-sys | 0.61.2 | CANDIDATE Mudança correlacionada; combinação não comprovada | contrato aprovado | 8 dias-projeto |
| bytes | 1.12.1 | PASS Todas as observações passaram | contrato aprovado | 5 dias-projeto |
| libc | 0.2.189 | PASS Todas as observações passaram | contrato aprovado | 8 dias-projeto |
| pin-project-lite | 0.2.17 | PASS Todas as observações passaram | contrato aprovado | 20 dias-projeto |
A coluna de medição é sobre a versão de cada dependência em si, não sobre o par. Um resolvedor ter colocado duas versões lado a lado não é prova de que funcionam juntas.
Versões de dependências por versão
Para que cada versão deste pacote resolveu seus filhos. O filho cuja versão se moveu vem primeiro: foi ali que uma atualização mudou algo sob os seus pés.
| Biblioteca | 1.53.1 | 1.43.0 |
|---|---|---|
| mio | 1.2.3 | 1.2.2 |
| socket2 | 0.6.5 | 0.5.10 |
| tokio-macros | 2.7.2 | 2.5.0 |
| windows-sys | 0.61.2 | 0.52.0 |
| backtrace | — | 0.3.76 |
| bytes | 1.12.1 | 1.12.1 |
| libc | 0.2.189 | 0.2.189 |
| pin-project-lite | 0.2.17 | 0.2.17 |
Moveram-se: 4 · iguais em todas as versões: 4
Uma aresta registra que um resolvedor colocou uma versão ao lado de outra em uma máquina real. Não é uma afirmação de que as duas funcionam juntas; essa pergunta é respondida por amostras e contratos, não pela presença de uma linha.
Clusters de falha recentes
-
observado PROJECT_TEST Lacuna de evidência ×2 1.43.0 → 1.53.1 executionContext=rust · os=linux · runtime=rust@1Qualidade da evidência: legacy-evidence-incomplete · Variantes de ambiente: 1 · Primeiro registro: 2026-09-08 · Visto por último: 2026-09-08Candidato a reverificação diagnóstica
-
observado PROJECT_COMPILE exit 101 ×2 1.53.1 os=linux sha256:a67fd218023f…error: could not compile `test-hyper-util` (bin <str>) due to 1 previous errorrust/rustc · compiler-diagnostic · outer cargo runQualidade da evidência: complete · Variantes de ambiente: 1 · Primeiro registro: 2026-09-19 · Visto por último: 2026-09-19
-
observado PROJECT_COMPILE exit 101 ×1 1.53.1 os=linux sha256:1043b6df5638…error: could not compile `test-hyper-util` (bin <str>) due to 1 previous error; 1 warning emittedrust/rustc · compiler-diagnostic · outer cargo checkQualidade da evidência: complete · Variantes de ambiente: 1 · Primeiro registro: 2026-09-19 · Visto por último: 2026-09-19
-
observado PROJECT_COMPILE exit 101 E0624 ×1 1.53.1 os=linux sha256:65fda95c6b71…error[E0624]: method `remaining` is privaterust/rustc · compiler-diagnostic · outer cargo runQualidade da evidência: complete · Variantes de ambiente: 1 · Primeiro registro: 2026-09-19 · Visto por último: 2026-09-19
-
observado PROJECT_COMPILE exit 101 E0599 ×1 1.53.1 os=linux sha256:689d8da7053d…error[E0599]: no method named `http1_only` found for mutable reference `&mut hyper_util::client::legacy::Builder` in the current scoperust/rustc · compiler-diagnostic · outer cargo runQualidade da evidência: complete · Variantes de ambiente: 1 · Primeiro registro: 2026-09-19 · Visto por último: 2026-09-19
-
observado PROJECT_COMPILE exit 101 E0433 ×1 1.53.1 os=linux sha256:b3ae21627e63…error[E0433]: cannot find module or crate `tokio` in this scoperust/rustc · compiler-diagnostic · outer cargo checkQualidade da evidência: complete · Variantes de ambiente: 1 · Primeiro registro: 2026-09-19 · Visto por último: 2026-09-19
-
observado PROJECT_COMPILE exit 101 E0432 ×1 1.53.1 os=linux sha256:cce7c6259bba…error[E0432]: unresolved imports `hyper_util::rt::WithHyperIo`, `hyper_util::rt::WithTokioIo`rust/rustc · compiler-diagnostic · outer cargo checkQualidade da evidência: complete · Variantes de ambiente: 1 · Primeiro registro: 2026-09-19 · Visto por último: 2026-09-19
-
observado PROJECT_COMPILE exit 101 ×1 1.53.1 os=linux sha256:ec2184db47b8…error: could not compile `sample-hyper` (bin <str>) due to 5 previous errors; 1 warning emittedrust/rustc · compiler-diagnostic · outer cargo runQualidade da evidência: complete · Variantes de ambiente: 1 · Primeiro registro: 2026-09-19 · Visto por último: 2026-09-19