記録cargotokio1.53.1
条件を変更
現在の条件
tokio @1.53.1ubuntu glibc · x64 · cargo 1
API ではなくパッケージ全体の合計
20 回中 12 回が成功
観測 — 実際のプロジェクトのビルドがこの座標から報告されました。
サンプルあり — この座標ではまだ実行していない (8)
- プロジェクト観測
- 12 / 20
- コントラクト検証
- この座標にはなし
- 独立した報告ピア
- 1
- 最終記録
- 2026-09-20
開ける証拠
依存関係のヘルス
このリリースの依存関係の組み合わせと失敗観測
観測された問題 1件 ·
変更 5件 ·
正常 3件
| ライブラリ | バージョン | ヘルス | その座標で測定されたこと | プロジェクト |
|---|---|---|---|---|
| mio | 1.2.2 | CANDIDATE 相関変更; 組み合わせ未証明 | コントラクト合格 | プロジェクト日 6 件 |
| mio | 1.2.3 | CANDIDATE 相関変更; 組み合わせ未証明 | ビルド観測済み | プロジェクト日 2 件 |
| socket2 | 0.6.5 | CANDIDATE 相関変更; 組み合わせ未証明 | コントラクト合格 | プロジェクト日 8 件 |
| tokio-macros | 2.7.2 | CANDIDATE 相関変更; 組み合わせ未証明 | コントラクト合格 | プロジェクト日 10 件 |
| windows-sys | 0.61.2 | CANDIDATE 相関変更; 組み合わせ未証明 | コントラクト合格 | プロジェクト日 8 件 |
| bytes | 1.12.1 | PASS すべての観測で成功 | コントラクト合格 | プロジェクト日 5 件 |
| libc | 0.2.189 | PASS すべての観測で成功 | コントラクト合格 | プロジェクト日 8 件 |
| pin-project-lite | 0.2.17 | PASS すべての観測で成功 | コントラクト合格 | プロジェクト日 20 件 |
測定列は各依存関係自身のリリースに関するもので、2つのリリースの組み合わせに関するものではありません。リゾルバが2つを並べたという事実は、両者が協調して動く証拠ではありません。
リリースごとの依存バージョン
このパッケージの各リリースが子をどのバージョンに解決したかです。バージョンが動いた子が先に並びます — アップグレードが足元で何かを変えた地点です。
| ライブラリ | 1.53.1 | 1.43.0 |
|---|---|---|
| mio | 1.2.3 | 1.2.2 |
| socket2 | 0.6.5 | 0.5.10 |
| tokio-macros | 2.7.2 | 2.5.0 |
| windows-sys | 0.61.2 | 0.52.0 |
| backtrace | — | 0.3.76 |
| bytes | 1.12.1 | 1.12.1 |
| libc | 0.2.189 | 0.2.189 |
| pin-project-lite | 0.2.17 | 0.2.17 |
変動: 4 · 全リリースで同一: 4
エッジは、実機でリゾルバがあるリリースを別のリリースの隣に置いたという記録です。両者が一緒に動くという主張ではありません。その問いに答えるのは、ここに行があることではなくサンプルと契約です。
最近の失敗クラスター
-
観測済み PROJECT_TEST 証拠の欠落 ×2 1.43.0 → 1.53.1 executionContext=rust · os=linux · runtime=rust@1証拠品質: legacy-evidence-incomplete · 環境バリアント: 1 · 初回記録: 2026-09-08 · 最終観測: 2026-09-08診断再検証候補
-
観測済み PROJECT_COMPILE exit 101 ×2 1.53.1 os=linux sha256:a67fd218023f…error: could not compile `test-hyper-util` (bin <str>) due to 1 previous errorrust/rustc · compiler-diagnostic · outer cargo run証拠品質: complete · 環境バリアント: 1 · 初回記録: 2026-09-19 · 最終観測: 2026-09-19
-
観測済み PROJECT_COMPILE exit 101 ×1 1.53.1 os=linux sha256:1043b6df5638…error: could not compile `test-hyper-util` (bin <str>) due to 1 previous error; 1 warning emittedrust/rustc · compiler-diagnostic · outer cargo check証拠品質: complete · 環境バリアント: 1 · 初回記録: 2026-09-19 · 最終観測: 2026-09-19
-
観測済み PROJECT_COMPILE exit 101 E0624 ×1 1.53.1 os=linux sha256:65fda95c6b71…error[E0624]: method `remaining` is privaterust/rustc · compiler-diagnostic · outer cargo run証拠品質: complete · 環境バリアント: 1 · 初回記録: 2026-09-19 · 最終観測: 2026-09-19
-
観測済み PROJECT_COMPILE exit 101 E0599 ×1 1.53.1 os=linux sha256:689d8da7053d…error[E0599]: no method named `http1_only` found for mutable reference `&mut hyper_util::client::legacy::Builder` in the current scoperust/rustc · compiler-diagnostic · outer cargo run証拠品質: complete · 環境バリアント: 1 · 初回記録: 2026-09-19 · 最終観測: 2026-09-19
-
観測済み PROJECT_COMPILE exit 101 E0433 ×1 1.53.1 os=linux sha256:b3ae21627e63…error[E0433]: cannot find module or crate `tokio` in this scoperust/rustc · compiler-diagnostic · outer cargo check証拠品質: complete · 環境バリアント: 1 · 初回記録: 2026-09-19 · 最終観測: 2026-09-19
-
観測済み PROJECT_COMPILE exit 101 E0432 ×1 1.53.1 os=linux sha256:cce7c6259bba…error[E0432]: unresolved imports `hyper_util::rt::WithHyperIo`, `hyper_util::rt::WithTokioIo`rust/rustc · compiler-diagnostic · outer cargo check証拠品質: complete · 環境バリアント: 1 · 初回記録: 2026-09-19 · 最終観測: 2026-09-19
-
観測済み PROJECT_COMPILE exit 101 ×1 1.53.1 os=linux sha256:ec2184db47b8…error: could not compile `sample-hyper` (bin <str>) due to 5 previous errors; 1 warning emittedrust/rustc · compiler-diagnostic · outer cargo run証拠品質: complete · 環境バリアント: 1 · 初回記録: 2026-09-19 · 最終観測: 2026-09-19