Relevéscargotokio1.53.1
Changer les conditions
Conditions actuelles
tokio @1.53.1ubuntu glibc · x64 · cargo 1
total du paquet, pas une API
12 sur 20 ont réussi
Observé — de vrais builds de projets ont fait remonter cette coordonnée.
il y a un échantillon ici et nous ne l'avons pas encore exécuté à cette coordonnée (8)
- Observations de projets
- 12 / 20
- Vérifications de contrat
- rien à cette coordonnée
- Pairs rapporteurs indépendants
- 1
- Dernier enregistrement
- 2026-09-20
Santé des dépendances
Combinaisons observées et preuves d'échec pour cette version
Premier échec observé
1.53.1
linux · rust@1 · executionContext=rust
2 FAIL · stage: PROJECT_TEST
| Bibliothèque | Version | Santé | Mesuré là-bas | Projets |
|---|---|---|---|---|
| mio | 1.2.2 | CANDIDATE Changement corrélé; combinaison non prouvée | contrat réussi | 6 jours-projet |
| mio | 1.2.3 | CANDIDATE Changement corrélé; combinaison non prouvée | builds observés | 2 jours-projet |
| socket2 | 0.6.5 | CANDIDATE Changement corrélé; combinaison non prouvée | contrat réussi | 8 jours-projet |
| tokio-macros | 2.7.2 | CANDIDATE Changement corrélé; combinaison non prouvée | contrat réussi | 10 jours-projet |
| windows-sys | 0.61.2 | CANDIDATE Changement corrélé; combinaison non prouvée | contrat réussi | 8 jours-projet |
| bytes | 1.12.1 | PASS Toutes les observations ont réussi | contrat réussi | 5 jours-projet |
| libc | 0.2.189 | PASS Toutes les observations ont réussi | contrat réussi | 8 jours-projet |
| pin-project-lite | 0.2.17 | PASS Toutes les observations ont réussi | contrat réussi | 20 jours-projet |
La colonne de mesure porte sur la version de chaque dépendance elle-même, pas sur la paire. Qu'un résolveur ait placé deux versions côte à côte ne prouve pas qu'elles fonctionnent ensemble.
Versions des dépendances au fil des versions
Ce vers quoi chaque version de ce paquet a résolu ses enfants. L'enfant dont la version a bougé vient en premier : c'est là qu'une mise à jour a changé quelque chose sous vos pieds.
| Bibliothèque | 1.53.1 | 1.43.0 |
|---|---|---|
| mio | 1.2.3 | 1.2.2 |
| socket2 | 0.6.5 | 0.5.10 |
| tokio-macros | 2.7.2 | 2.5.0 |
| windows-sys | 0.61.2 | 0.52.0 |
| backtrace | — | 0.3.76 |
| bytes | 1.12.1 | 1.12.1 |
| libc | 0.2.189 | 0.2.189 |
| pin-project-lite | 0.2.17 | 0.2.17 |
Ont bougé : 4 · identiques à chaque version : 4
Une arête indique qu'un résolveur a placé une version à côté d'une autre sur une machine réelle. Ce n'est pas une affirmation qu'elles fonctionnent ensemble ; à cette question répondent les échantillons et les contrats, pas la présence d'une ligne.
Clusters d'échecs récents
-
observé PROJECT_TEST Lacune de preuve ×2 1.43.0 → 1.53.1 executionContext=rust · os=linux · runtime=rust@1Qualité de preuve: legacy-evidence-incomplete · Variantes d’environnement: 1 · Premier relevé: 2026-09-08 · Dernière observation: 2026-09-08Candidat à une revérification diagnostique
-
observé PROJECT_COMPILE exit 101 ×2 1.53.1 os=linux sha256:a67fd218023f…error: could not compile `test-hyper-util` (bin <str>) due to 1 previous errorrust/rustc · compiler-diagnostic · outer cargo runQualité de preuve: complete · Variantes d’environnement: 1 · Premier relevé: 2026-09-19 · Dernière observation: 2026-09-19
-
observé PROJECT_COMPILE exit 101 ×1 1.53.1 os=linux sha256:1043b6df5638…error: could not compile `test-hyper-util` (bin <str>) due to 1 previous error; 1 warning emittedrust/rustc · compiler-diagnostic · outer cargo checkQualité de preuve: complete · Variantes d’environnement: 1 · Premier relevé: 2026-09-19 · Dernière observation: 2026-09-19
-
observé PROJECT_COMPILE exit 101 E0624 ×1 1.53.1 os=linux sha256:65fda95c6b71…error[E0624]: method `remaining` is privaterust/rustc · compiler-diagnostic · outer cargo runQualité de preuve: complete · Variantes d’environnement: 1 · Premier relevé: 2026-09-19 · Dernière observation: 2026-09-19
-
observé PROJECT_COMPILE exit 101 E0599 ×1 1.53.1 os=linux sha256:689d8da7053d…error[E0599]: no method named `http1_only` found for mutable reference `&mut hyper_util::client::legacy::Builder` in the current scoperust/rustc · compiler-diagnostic · outer cargo runQualité de preuve: complete · Variantes d’environnement: 1 · Premier relevé: 2026-09-19 · Dernière observation: 2026-09-19
-
observé PROJECT_COMPILE exit 101 E0433 ×1 1.53.1 os=linux sha256:b3ae21627e63…error[E0433]: cannot find module or crate `tokio` in this scoperust/rustc · compiler-diagnostic · outer cargo checkQualité de preuve: complete · Variantes d’environnement: 1 · Premier relevé: 2026-09-19 · Dernière observation: 2026-09-19
-
observé PROJECT_COMPILE exit 101 E0432 ×1 1.53.1 os=linux sha256:cce7c6259bba…error[E0432]: unresolved imports `hyper_util::rt::WithHyperIo`, `hyper_util::rt::WithTokioIo`rust/rustc · compiler-diagnostic · outer cargo checkQualité de preuve: complete · Variantes d’environnement: 1 · Premier relevé: 2026-09-19 · Dernière observation: 2026-09-19
-
observé PROJECT_COMPILE exit 101 ×1 1.53.1 os=linux sha256:ec2184db47b8…error: could not compile `sample-hyper` (bin <str>) due to 5 previous errors; 1 warning emittedrust/rustc · compiler-diagnostic · outer cargo runQualité de preuve: complete · Variantes d’environnement: 1 · Premier relevé: 2026-09-19 · Dernière observation: 2026-09-19