Registroscargotokio1.53.1
Cambiar las condiciones
Condiciones actuales
tokio @1.53.1ubuntu glibc · x64 · cargo 1
total del paquete, no una API
12 de 20 pasaron
Observado: builds reales de proyectos reportaron desde esta coordenada.
hay una muestra aquí y todavía no la hemos ejecutado en esta coordenada (8)
- Observaciones de proyectos
- 12 / 20
- Verificaciones de contrato
- nada en esta coordenada
- Peers independientes que reportaron
- 1
- Último registro
- 2026-09-20
Salud de dependencias
Combinaciones observadas y evidencia de fallos para esta versión
Primer fallo observado
1.53.1
linux · rust@1 · executionContext=rust
2 FAIL · stage: PROJECT_TEST
| Biblioteca | Versión | Estado | Medido allí | Proyectos |
|---|---|---|---|---|
| mio | 1.2.2 | CANDIDATE Cambio correlacionado; combinación no probada | contrato aprobado | 6 días-proyecto |
| mio | 1.2.3 | CANDIDATE Cambio correlacionado; combinación no probada | compilaciones observadas | 2 días-proyecto |
| socket2 | 0.6.5 | CANDIDATE Cambio correlacionado; combinación no probada | contrato aprobado | 8 días-proyecto |
| tokio-macros | 2.7.2 | CANDIDATE Cambio correlacionado; combinación no probada | contrato aprobado | 10 días-proyecto |
| windows-sys | 0.61.2 | CANDIDATE Cambio correlacionado; combinación no probada | contrato aprobado | 8 días-proyecto |
| bytes | 1.12.1 | PASS Todas las observaciones pasaron | contrato aprobado | 5 días-proyecto |
| libc | 0.2.189 | PASS Todas las observaciones pasaron | contrato aprobado | 8 días-proyecto |
| pin-project-lite | 0.2.17 | PASS Todas las observaciones pasaron | contrato aprobado | 20 días-proyecto |
La columna de medición se refiere a la versión de cada dependencia en sí, no al par. Que un resolutor haya colocado dos versiones juntas no prueba que funcionen juntas.
Versiones de dependencias por versión
A qué resolvió sus hijos cada versión de este paquete. Primero va el hijo cuya versión se movió: ahí una actualización cambió algo bajo tus pies.
| Biblioteca | 1.53.1 | 1.43.0 |
|---|---|---|
| mio | 1.2.3 | 1.2.2 |
| socket2 | 0.6.5 | 0.5.10 |
| tokio-macros | 2.7.2 | 2.5.0 |
| windows-sys | 0.61.2 | 0.52.0 |
| backtrace | — | 0.3.76 |
| bytes | 1.12.1 | 1.12.1 |
| libc | 0.2.189 | 0.2.189 |
| pin-project-lite | 0.2.17 | 0.2.17 |
Se movieron: 4 · iguales en todas las versiones: 4
Una arista registra que un resolutor colocó una versión junto a otra en una máquina real. No afirma que ambas funcionen juntas; a esa pregunta responden las muestras y los contratos, no la presencia de una fila.
Clústeres de fallos recientes
-
observado PROJECT_TEST Brecha de evidencia ×2 1.43.0 → 1.53.1 executionContext=rust · os=linux · runtime=rust@1Calidad de evidencia: legacy-evidence-incomplete · Variantes de entorno: 1 · Primer registro: 2026-09-08 · Última observación: 2026-09-08Candidato a reverificación diagnóstica
-
observado PROJECT_COMPILE exit 101 ×2 1.53.1 os=linux sha256:a67fd218023f…error: could not compile `test-hyper-util` (bin <str>) due to 1 previous errorrust/rustc · compiler-diagnostic · outer cargo runCalidad de evidencia: complete · Variantes de entorno: 1 · Primer registro: 2026-09-19 · Última observación: 2026-09-19
-
observado PROJECT_COMPILE exit 101 ×1 1.53.1 os=linux sha256:1043b6df5638…error: could not compile `test-hyper-util` (bin <str>) due to 1 previous error; 1 warning emittedrust/rustc · compiler-diagnostic · outer cargo checkCalidad de evidencia: complete · Variantes de entorno: 1 · Primer registro: 2026-09-19 · Última observación: 2026-09-19
-
observado PROJECT_COMPILE exit 101 E0624 ×1 1.53.1 os=linux sha256:65fda95c6b71…error[E0624]: method `remaining` is privaterust/rustc · compiler-diagnostic · outer cargo runCalidad de evidencia: complete · Variantes de entorno: 1 · Primer registro: 2026-09-19 · Última observación: 2026-09-19
-
observado PROJECT_COMPILE exit 101 E0599 ×1 1.53.1 os=linux sha256:689d8da7053d…error[E0599]: no method named `http1_only` found for mutable reference `&mut hyper_util::client::legacy::Builder` in the current scoperust/rustc · compiler-diagnostic · outer cargo runCalidad de evidencia: complete · Variantes de entorno: 1 · Primer registro: 2026-09-19 · Última observación: 2026-09-19
-
observado PROJECT_COMPILE exit 101 E0433 ×1 1.53.1 os=linux sha256:b3ae21627e63…error[E0433]: cannot find module or crate `tokio` in this scoperust/rustc · compiler-diagnostic · outer cargo checkCalidad de evidencia: complete · Variantes de entorno: 1 · Primer registro: 2026-09-19 · Última observación: 2026-09-19
-
observado PROJECT_COMPILE exit 101 E0432 ×1 1.53.1 os=linux sha256:cce7c6259bba…error[E0432]: unresolved imports `hyper_util::rt::WithHyperIo`, `hyper_util::rt::WithTokioIo`rust/rustc · compiler-diagnostic · outer cargo checkCalidad de evidencia: complete · Variantes de entorno: 1 · Primer registro: 2026-09-19 · Última observación: 2026-09-19
-
observado PROJECT_COMPILE exit 101 ×1 1.53.1 os=linux sha256:ec2184db47b8…error: could not compile `sample-hyper` (bin <str>) due to 5 previous errors; 1 warning emittedrust/rustc · compiler-diagnostic · outer cargo runCalidad de evidencia: complete · Variantes de entorno: 1 · Primer registro: 2026-09-19 · Última observación: 2026-09-19