Записиcargotokio1.53.1axum::body::Body
Изменить условия
Текущие условия
axum::body::Body @1.53.1alpine musl · x64 · rust 1 · cargo · rust
2 из 3 прошли
Проверено — эта сеть выполнила контракт в этой координате.
образец есть — в этой координате записаны и успешный, и неуспешный запуск (1)
- Наблюдения в проектах
- в этой координате ничего
- Проверки контрактом
- 2 / 3
- Перекрёстная проверка
- воспроизведено двумя и более независимыми пирами
- Последняя запись
- 2026-09-15
Здоровье зависимостей
Наблюдаемые комбинации и свидетельства сбоев для этого выпуска
Первый обнаруженный сбой
1.53.1
linux · rust@1 · executionContext=rust
2 FAIL · stage: PROJECT_TEST
| Библиотека | Версия | Состояние | Измерено там | Проектов |
|---|---|---|---|---|
| libc | 0.2.189 | CANDIDATE Коррелированное изменение; комбинация не подтверждена | контракт пройден | 8 проектных дней |
| mio | 1.2.2 | CANDIDATE Коррелированное изменение; комбинация не подтверждена | контракт пройден | 6 проектных дней |
| mio | 1.2.3 | CANDIDATE Коррелированное изменение; комбинация не подтверждена | сборки наблюдались | 2 проектных дня |
| socket2 | 0.6.5 | CANDIDATE Коррелированное изменение; комбинация не подтверждена | контракт пройден | 8 проектных дней |
| tokio-macros | 2.7.2 | CANDIDATE Коррелированное изменение; комбинация не подтверждена | контракт пройден | 10 проектных дней |
| windows-sys | 0.61.2 | CANDIDATE Коррелированное изменение; комбинация не подтверждена | контракт пройден | 8 проектных дней |
| bytes | 1.12.1 | PASS Все наблюдения прошли успешно | контракт пройден | 5 проектных дней |
| pin-project-lite | 0.2.17 | PASS Все наблюдения прошли успешно | контракт пройден | 20 проектных дней |
Столбец измерения относится к релизу самой зависимости, а не к паре. То, что резолвер поставил два релиза рядом, не доказывает, что они работают вместе.
Версии зависимостей по выпускам
К чему каждый выпуск этого пакета разрешил своих потомков. Потомок, чья версия сдвинулась, идёт первым: там обновление изменило что-то под вами.
| Библиотека | 1.54.0 | 1.53.1 | 1.43.0 |
|---|---|---|---|
| libc | 0.2.191 | 0.2.189 | 0.2.189 |
| mio | 1.2.4 | 1.2.3 | 1.2.2 |
| socket2 | 0.6.5 | 0.6.5 | 0.5.10 |
| tokio-macros | — | 2.7.2 | 2.5.0 |
| windows-sys | 0.61.2 | 0.61.2 | 0.52.0 |
| backtrace | — | — | 0.3.76 |
| bytes | 1.12.1 | 1.12.1 | 1.12.1 |
| pin-project-lite | 0.2.17 | 0.2.17 | 0.2.17 |
Сдвинулось: 5 · одинаково во всех выпусках: 3
Ребро фиксирует, что резолвер поставил один релиз рядом с другим на реальной машине. Это не утверждение, что они работают вместе; на этот вопрос отвечают образцы и контракты, а не наличие строки.
Недавние кластеры сбоев
-
наблюдалось PROJECT_TEST Пробел в данных ×2 1.43.0 → 1.53.1 executionContext=rust · os=linux · runtime=rust@1Качество данных: legacy-evidence-incomplete · Варианты среды: 1 · Первая запись: 2026-09-08 · Последнее наблюдение: 2026-09-08Кандидат на диагностическую перепроверку
-
наблюдалось PROJECT_COMPILE exit 101 ×2 1.53.1 os=linux sha256:a67fd218023f…error: could not compile `test-hyper-util` (bin <str>) due to 1 previous errorrust/rustc · compiler-diagnostic · outer cargo runКачество данных: complete · Варианты среды: 1 · Первая запись: 2026-09-19 · Последнее наблюдение: 2026-09-19
-
наблюдалось PROJECT_COMPILE exit 101 ×1 1.53.1 os=linux sha256:1043b6df5638…error: could not compile `test-hyper-util` (bin <str>) due to 1 previous error; 1 warning emittedrust/rustc · compiler-diagnostic · outer cargo checkКачество данных: complete · Варианты среды: 1 · Первая запись: 2026-09-19 · Последнее наблюдение: 2026-09-19
-
наблюдалось PROJECT_COMPILE exit 101 E0624 ×1 1.53.1 os=linux sha256:65fda95c6b71…error[E0624]: method `remaining` is privaterust/rustc · compiler-diagnostic · outer cargo runКачество данных: complete · Варианты среды: 1 · Первая запись: 2026-09-19 · Последнее наблюдение: 2026-09-19
-
наблюдалось PROJECT_COMPILE exit 101 E0599 ×1 1.53.1 os=linux sha256:689d8da7053d…error[E0599]: no method named `http1_only` found for mutable reference `&mut hyper_util::client::legacy::Builder` in the current scoperust/rustc · compiler-diagnostic · outer cargo runКачество данных: complete · Варианты среды: 1 · Первая запись: 2026-09-19 · Последнее наблюдение: 2026-09-19
-
наблюдалось PROJECT_COMPILE exit 101 E0433 ×1 1.53.1 os=linux sha256:b3ae21627e63…error[E0433]: cannot find module or crate `tokio` in this scoperust/rustc · compiler-diagnostic · outer cargo checkКачество данных: complete · Варианты среды: 1 · Первая запись: 2026-09-19 · Последнее наблюдение: 2026-09-19
-
наблюдалось PROJECT_COMPILE exit 101 E0432 ×1 1.53.1 os=linux sha256:cce7c6259bba…error[E0432]: unresolved imports `hyper_util::rt::WithHyperIo`, `hyper_util::rt::WithTokioIo`rust/rustc · compiler-diagnostic · outer cargo checkКачество данных: complete · Варианты среды: 1 · Первая запись: 2026-09-19 · Последнее наблюдение: 2026-09-19
-
наблюдалось PROJECT_COMPILE exit 101 ×1 1.53.1 os=linux sha256:ec2184db47b8…error: could not compile `sample-hyper` (bin <str>) due to 5 previous errors; 1 warning emittedrust/rustc · compiler-diagnostic · outer cargo runКачество данных: complete · Варианты среды: 1 · Первая запись: 2026-09-19 · Последнее наблюдение: 2026-09-19