记录cargotokio1.53.1axum::body::Body
更改条件
依赖健康度
此版本的依赖组合与失败观测
观测到问题 1 项 ·
变动 6 项 ·
正常 2 项
| 库 | 版本 | 健康状态 | 在那里测得 | 项目 |
|---|---|---|---|---|
| libc | 0.2.189 | CANDIDATE 相关变更;组合未证实 | 契约通过 | 8 个项目日 |
| mio | 1.2.2 | CANDIDATE 相关变更;组合未证实 | 契约通过 | 6 个项目日 |
| mio | 1.2.3 | CANDIDATE 相关变更;组合未证实 | 观测到构建 | 2 个项目日 |
| socket2 | 0.6.5 | CANDIDATE 相关变更;组合未证实 | 契约通过 | 8 个项目日 |
| tokio-macros | 2.7.2 | CANDIDATE 相关变更;组合未证实 | 契约通过 | 10 个项目日 |
| windows-sys | 0.61.2 | CANDIDATE 相关变更;组合未证实 | 契约通过 | 8 个项目日 |
| bytes | 1.12.1 | PASS 所有观测均通过 | 契约通过 | 5 个项目日 |
| pin-project-lite | 0.2.17 | PASS 所有观测均通过 | 契约通过 | 20 个项目日 |
测量列说的是每个依赖自身版本的情况,而不是这一对的情况。解析器把两个版本放在一起,并不证明它们能协同工作。
各版本的依赖版本
本包的每个版本把子依赖解析到了哪个版本。版本发生变动的子依赖排在最前:升级正是在那里改变了你脚下的东西。
| 库 | 1.54.0 | 1.53.1 | 1.43.0 |
|---|---|---|---|
| libc | 0.2.191 | 0.2.189 | 0.2.189 |
| mio | 1.2.4 | 1.2.3 | 1.2.2 |
| socket2 | 0.6.5 | 0.6.5 | 0.5.10 |
| tokio-macros | — | 2.7.2 | 2.5.0 |
| windows-sys | 0.61.2 | 0.61.2 | 0.52.0 |
| backtrace | — | — | 0.3.76 |
| bytes | 1.12.1 | 1.12.1 | 1.12.1 |
| pin-project-lite | 0.2.17 | 0.2.17 | 0.2.17 |
发生变动:5 · 所有版本相同:3
一条边记录的是解析器在真实机器上把一个版本放在了另一个版本旁边。它并不主张两者能协同工作;那个问题由样本和契约回答,而不是由这里存在一行来回答。
近期失败聚类
-
已观测 PROJECT_TEST 证据缺口 ×2 1.43.0 → 1.53.1 executionContext=rust · os=linux · runtime=rust@1证据质量: legacy-evidence-incomplete · 环境变体: 1 · 首次记录: 2026-09-08 · 最近观测: 2026-09-08诊断复验候选
-
已观测 PROJECT_COMPILE exit 101 ×2 1.53.1 os=linux sha256:a67fd218023f…error: could not compile `test-hyper-util` (bin <str>) due to 1 previous errorrust/rustc · compiler-diagnostic · outer cargo run证据质量: complete · 环境变体: 1 · 首次记录: 2026-09-19 · 最近观测: 2026-09-19
-
已观测 PROJECT_COMPILE exit 101 ×1 1.53.1 os=linux sha256:1043b6df5638…error: could not compile `test-hyper-util` (bin <str>) due to 1 previous error; 1 warning emittedrust/rustc · compiler-diagnostic · outer cargo check证据质量: complete · 环境变体: 1 · 首次记录: 2026-09-19 · 最近观测: 2026-09-19
-
已观测 PROJECT_COMPILE exit 101 E0624 ×1 1.53.1 os=linux sha256:65fda95c6b71…error[E0624]: method `remaining` is privaterust/rustc · compiler-diagnostic · outer cargo run证据质量: complete · 环境变体: 1 · 首次记录: 2026-09-19 · 最近观测: 2026-09-19
-
已观测 PROJECT_COMPILE exit 101 E0599 ×1 1.53.1 os=linux sha256:689d8da7053d…error[E0599]: no method named `http1_only` found for mutable reference `&mut hyper_util::client::legacy::Builder` in the current scoperust/rustc · compiler-diagnostic · outer cargo run证据质量: complete · 环境变体: 1 · 首次记录: 2026-09-19 · 最近观测: 2026-09-19
-
已观测 PROJECT_COMPILE exit 101 E0433 ×1 1.53.1 os=linux sha256:b3ae21627e63…error[E0433]: cannot find module or crate `tokio` in this scoperust/rustc · compiler-diagnostic · outer cargo check证据质量: complete · 环境变体: 1 · 首次记录: 2026-09-19 · 最近观测: 2026-09-19
-
已观测 PROJECT_COMPILE exit 101 E0432 ×1 1.53.1 os=linux sha256:cce7c6259bba…error[E0432]: unresolved imports `hyper_util::rt::WithHyperIo`, `hyper_util::rt::WithTokioIo`rust/rustc · compiler-diagnostic · outer cargo check证据质量: complete · 环境变体: 1 · 首次记录: 2026-09-19 · 最近观测: 2026-09-19
-
已观测 PROJECT_COMPILE exit 101 ×1 1.53.1 os=linux sha256:ec2184db47b8…error: could not compile `sample-hyper` (bin <str>) due to 5 previous errors; 1 warning emittedrust/rustc · compiler-diagnostic · outer cargo run证据质量: complete · 环境变体: 1 · 首次记录: 2026-09-19 · 最近观测: 2026-09-19