记录cargotokio-macros2.7.2
更改条件
依赖健康度
此版本的依赖组合与失败观测
观测到问题 1 项 ·
变动 2 项 ·
正常 2 项
| 库 | 版本 | 健康状态 | 在那里测得 | 项目 |
|---|---|---|---|---|
| syn | 3.0.3 | CANDIDATE 相关变更;组合未证实 | 契约通过 | 10 个项目日 |
| syn | 3.0.5 | CANDIDATE 相关变更;组合未证实 | 契约通过 | 2 个项目日 |
| proc-macro2 | 1.0.107 | PASS 所有观测均通过 | 契约通过 | 12 个项目日 |
| quote | 1.0.47 | PASS 所有观测均通过 | 契约通过 | 12 个项目日 |
测量列说的是每个依赖自身版本的情况,而不是这一对的情况。解析器把两个版本放在一起,并不证明它们能协同工作。
各版本的依赖版本
本包的每个版本把子依赖解析到了哪个版本。版本发生变动的子依赖排在最前:升级正是在那里改变了你脚下的东西。
发生变动:1 · 所有版本相同:2
一条边记录的是解析器在真实机器上把一个版本放在了另一个版本旁边。它并不主张两者能协同工作;那个问题由样本和契约回答,而不是由这里存在一行来回答。
近期失败聚类
-
已观测 PROJECT_COMPILE exit 101 E0308 ×1 2.7.2 os=linux sha256:0479254218ac…error[E0308]: mismatched typesrust/rustc · compiler-diagnostic · outer cargo test证据质量: complete · 环境变体: 1 · 首次记录: 2026-09-16 · 最近观测: 2026-09-16
-
已观测 PROJECT_COMPILE exit 101 E0433 ×1 2.7.2 os=linux sha256:76da7807743b…error[E0433]: cannot find `pin` in `tokio` · error[E0433]: cannot find `pin` in `tokio_macros_sample`rust/rustc · compiler-diagnostic · outer cargo test证据质量: complete · 环境变体: 1 · 首次记录: 2026-09-16 · 最近观测: 2026-09-16
-
已观测 PROJECT_COMPILE exit 101 ×1 2.7.2 os=linux sha256:ddfcd6108cf7…error: could not compile `tokio_macros_sample` (test <str>) due to 6 previous errorsrust/rustc · compiler-diagnostic · outer cargo test证据质量: complete · 环境变体: 1 · 首次记录: 2026-09-16 · 最近观测: 2026-09-16