记录cargothiserror-impl2.0.20
更改条件
依赖健康度
此版本的依赖组合与失败观测
观测到问题 1 项 ·
正常 5 项
| 库 | 版本 | 健康状态 | 在那里测得 | 项目 |
|---|---|---|---|---|
| proc-macro2 | 1.0.107 | PASS 所有观测均通过 | 契约通过 | 8 个项目日 |
| quote | 1.0.47 | PASS 所有观测均通过 | 契约通过 | 8 个项目日 |
| syn | 3.0.3 | PASS 所有观测均通过 | 契约通过 | 5 个项目日 |
| syn | 3.0.5 | PASS 所有观测均通过 | 契约通过 | 1 个项目日 |
| syn | 3.0.6 | PASS 所有观测均通过 | 契约通过 | 2 个项目日 |
测量列说的是每个依赖自身版本的情况,而不是这一对的情况。解析器把两个版本放在一起,并不证明它们能协同工作。
近期失败聚类
-
已观测 PROJECT_COMPILE exit 101 ×1 2.0.20 os=linux sha256:4c09382245cf…error: could not compile `test_cargo` (bin <str>) due to 1 previous errorrust/rustc · compiler-diagnostic · outer cargo check证据质量: complete · 环境变体: 1 · 首次记录: 2026-09-19 · 最近观测: 2026-09-19
-
已观测 PROJECT_COMPILE exit 101 E0433 ×1 2.0.20 os=linux sha256:963d5ad492f6…error[E0433]: cannot find `__private20` in `thiserror`rust/rustc · compiler-diagnostic · outer cargo check证据质量: complete · 环境变体: 1 · 首次记录: 2026-09-19 · 最近观测: 2026-09-19
-
已观测 PROJECT_COMPILE exit 101 ×1 2.0.20 os=linux sha256:be5055744d31…error: could not compile `test_cargo` (bin <str>) due to 2 previous errorsrust/rustc · compiler-diagnostic · outer cargo run证据质量: complete · 环境变体: 1 · 首次记录: 2026-09-19 · 最近观测: 2026-09-19
-
已观测 PROJECT_COMPILE exit 101 E0432 ×1 2.0.20 os=linux sha256:dd2ae662f4db…error[E0432]: unresolved import `thiserror`rust/rustc · compiler-diagnostic · outer cargo run证据质量: complete · 环境变体: 1 · 首次记录: 2026-09-19 · 最近观测: 2026-09-19
-
已观测 PROJECT_COMPILE exit 101 E0599 ×1 2.0.20 os=linux sha256:f07bb2beb9ac…error[E0599]: no method named `as_display` found for reference `&String` in the current scoperust/rustc · compiler-diagnostic · outer cargo run证据质量: complete · 环境变体: 1 · 首次记录: 2026-09-19 · 最近观测: 2026-09-19