Registroscargothiserror-impl2.0.20
Mudar as condições
Condições atuais
thiserror-impl @2.0.20alpine musl · x64 · rust 1 · cargo · rust
total do pacote, não uma API
Registrado como presente em projetos. Nada foi executado nesta coordenada.
Observado — builds reais de projetos reportaram desta coordenada.
ainda sem amostra nesta coordenada
- Observações de projetos
- nada nesta coordenada
- Verificações de contrato
- nada nesta coordenada
- Registros de uso
- 1
- Peers independentes que reportaram
- 1
- Último registro
- 2026-09-08
Evidências que você pode abrir
Saúde das dependências
Combinações observadas e evidências de falha para esta versão
Problemas observados: 1 ·
Estáveis: 5
Primeira quebra observada
2.0.20
linux
1 FAIL
· stage: PROJECT_COMPILE
· fingerprint: sha256:4c09382245cfb2fc028492af71795c84bcfe40918b830b5beed16f0d8fcbd751
| Biblioteca | Versão | Saúde | Medido ali | Projetos |
|---|---|---|---|---|
| proc-macro2 | 1.0.107 | PASS Todas as observações passaram | contrato aprovado | 8 dias-projeto |
| quote | 1.0.47 | PASS Todas as observações passaram | contrato aprovado | 8 dias-projeto |
| syn | 3.0.3 | PASS Todas as observações passaram | contrato aprovado | 5 dias-projeto |
| syn | 3.0.5 | PASS Todas as observações passaram | contrato aprovado | 1 dia-projeto |
| syn | 3.0.6 | PASS Todas as observações passaram | contrato aprovado | 2 dias-projeto |
A coluna de medição é sobre a versão de cada dependência em si, não sobre o par. Um resolvedor ter colocado duas versões lado a lado não é prova de que funcionam juntas.
Clusters de falha recentes
-
observado PROJECT_COMPILE exit 101 ×1 2.0.20 os=linux sha256:4c09382245cf…error: could not compile `test_cargo` (bin <str>) due to 1 previous errorrust/rustc · compiler-diagnostic · outer cargo checkQualidade da evidência: complete · Variantes de ambiente: 1 · Primeiro registro: 2026-09-19 · Visto por último: 2026-09-19
-
observado PROJECT_COMPILE exit 101 E0433 ×1 2.0.20 os=linux sha256:963d5ad492f6…error[E0433]: cannot find `__private20` in `thiserror`rust/rustc · compiler-diagnostic · outer cargo checkQualidade da evidência: complete · Variantes de ambiente: 1 · Primeiro registro: 2026-09-19 · Visto por último: 2026-09-19
-
observado PROJECT_COMPILE exit 101 ×1 2.0.20 os=linux sha256:be5055744d31…error: could not compile `test_cargo` (bin <str>) due to 2 previous errorsrust/rustc · compiler-diagnostic · outer cargo runQualidade da evidência: complete · Variantes de ambiente: 1 · Primeiro registro: 2026-09-19 · Visto por último: 2026-09-19
-
observado PROJECT_COMPILE exit 101 E0432 ×1 2.0.20 os=linux sha256:dd2ae662f4db…error[E0432]: unresolved import `thiserror`rust/rustc · compiler-diagnostic · outer cargo runQualidade da evidência: complete · Variantes de ambiente: 1 · Primeiro registro: 2026-09-19 · Visto por último: 2026-09-19
-
observado PROJECT_COMPILE exit 101 E0599 ×1 2.0.20 os=linux sha256:f07bb2beb9ac…error[E0599]: no method named `as_display` found for reference `&String` in the current scoperust/rustc · compiler-diagnostic · outer cargo runQualidade da evidência: complete · Variantes de ambiente: 1 · Primeiro registro: 2026-09-19 · Visto por último: 2026-09-19