Aufzeichnungencargothiserror-impl2.0.20
Bedingungen ändern
Aktuelle Bedingungen
thiserror-impl @2.0.20alpine musl · x64 · rust 1 · cargo · rust
Paketsumme, keine API
Als in Projekten vorhanden erfasst. An dieser Koordinate wurde nichts ausgeführt.
Beobachtet — echte Projekt-Builds haben von dieser Koordinate berichtet.
an dieser Koordinate noch kein Sample
- Projektbeobachtungen
- nichts an dieser Koordinate
- Contract-Verifikationen
- nichts an dieser Koordinate
- Nutzungsdatensätze
- 1
- Unabhängig meldende Peers
- 1
- Zuletzt erfasst
- 2026-09-08
Nachweise zum Öffnen
Abhängigkeits-Zustand
Beobachtete Kombinationen und Fehlernachweise für dieses Release
Beobachtete Probleme: 1 ·
Stabil: 5
Erster beobachteter Fehler
2.0.20
linux
1 FAIL
· stage: PROJECT_COMPILE
· fingerprint: sha256:4c09382245cfb2fc028492af71795c84bcfe40918b830b5beed16f0d8fcbd751
| Bibliothek | Version | Zustand | Dort gemessen | Projekte |
|---|---|---|---|---|
| proc-macro2 | 1.0.107 | PASS Alle Beobachtungen bestanden | Contract bestanden | 8 Projekttage |
| quote | 1.0.47 | PASS Alle Beobachtungen bestanden | Contract bestanden | 8 Projekttage |
| syn | 3.0.3 | PASS Alle Beobachtungen bestanden | Contract bestanden | 5 Projekttage |
| syn | 3.0.5 | PASS Alle Beobachtungen bestanden | Contract bestanden | 1 Projekttag |
| syn | 3.0.6 | PASS Alle Beobachtungen bestanden | Contract bestanden | 2 Projekttage |
Die Messspalte betrifft das Release der jeweiligen Abhängigkeit selbst, nicht das Paar. Dass ein Resolver zwei Releases nebeneinandergestellt hat, ist kein Beleg dafür, dass sie zusammen funktionieren.
Aktuelle Fehler-Cluster
-
beobachtet PROJECT_COMPILE exit 101 ×1 2.0.20 os=linux sha256:4c09382245cf…error: could not compile `test_cargo` (bin <str>) due to 1 previous errorrust/rustc · compiler-diagnostic · outer cargo checkBeweisqualität: complete · Umgebungsvarianten: 1 · Zuerst erfasst: 2026-09-19 · Zuletzt gesehen: 2026-09-19
-
beobachtet PROJECT_COMPILE exit 101 E0433 ×1 2.0.20 os=linux sha256:963d5ad492f6…error[E0433]: cannot find `__private20` in `thiserror`rust/rustc · compiler-diagnostic · outer cargo checkBeweisqualität: complete · Umgebungsvarianten: 1 · Zuerst erfasst: 2026-09-19 · Zuletzt gesehen: 2026-09-19
-
beobachtet PROJECT_COMPILE exit 101 ×1 2.0.20 os=linux sha256:be5055744d31…error: could not compile `test_cargo` (bin <str>) due to 2 previous errorsrust/rustc · compiler-diagnostic · outer cargo runBeweisqualität: complete · Umgebungsvarianten: 1 · Zuerst erfasst: 2026-09-19 · Zuletzt gesehen: 2026-09-19
-
beobachtet PROJECT_COMPILE exit 101 E0432 ×1 2.0.20 os=linux sha256:dd2ae662f4db…error[E0432]: unresolved import `thiserror`rust/rustc · compiler-diagnostic · outer cargo runBeweisqualität: complete · Umgebungsvarianten: 1 · Zuerst erfasst: 2026-09-19 · Zuletzt gesehen: 2026-09-19
-
beobachtet PROJECT_COMPILE exit 101 E0599 ×1 2.0.20 os=linux sha256:f07bb2beb9ac…error[E0599]: no method named `as_display` found for reference `&String` in the current scoperust/rustc · compiler-diagnostic · outer cargo runBeweisqualität: complete · Umgebungsvarianten: 1 · Zuerst erfasst: 2026-09-19 · Zuletzt gesehen: 2026-09-19