Записиcargothiserror-impl2.0.20
Изменить условия
Текущие условия
thiserror-impl @2.0.20alpine musl · x64 · rust 1 · cargo · rust
итог по пакету, а не API
Зафиксировано только присутствие в проектах. В этой координате ничего не запускалось.
Наблюдение — реальные сборки проектов сообщили об этой координате.
в этой координате образца пока нет
- Наблюдения в проектах
- в этой координате ничего
- Проверки контрактом
- в этой координате ничего
- Записи об использовании
- 1
- Независимые сообщившие пиры
- 1
- Последняя запись
- 2026-09-08
Свидетельства, которые можно открыть
Здоровье зависимостей
Наблюдаемые комбинации и свидетельства сбоев для этого выпуска
Замечено проблем: 1 ·
Стабильно: 5
Первый обнаруженный сбой
2.0.20
linux
1 FAIL
· stage: PROJECT_COMPILE
· fingerprint: sha256:4c09382245cfb2fc028492af71795c84bcfe40918b830b5beed16f0d8fcbd751
| Библиотека | Версия | Состояние | Измерено там | Проектов |
|---|---|---|---|---|
| proc-macro2 | 1.0.107 | PASS Все наблюдения прошли успешно | контракт пройден | 8 проектных дней |
| quote | 1.0.47 | PASS Все наблюдения прошли успешно | контракт пройден | 8 проектных дней |
| syn | 3.0.3 | PASS Все наблюдения прошли успешно | контракт пройден | 5 проектных дней |
| syn | 3.0.5 | PASS Все наблюдения прошли успешно | контракт пройден | 1 проектный день |
| syn | 3.0.6 | PASS Все наблюдения прошли успешно | контракт пройден | 2 проектных дня |
Столбец измерения относится к релизу самой зависимости, а не к паре. То, что резолвер поставил два релиза рядом, не доказывает, что они работают вместе.
Недавние кластеры сбоев
-
наблюдалось PROJECT_COMPILE exit 101 ×1 2.0.20 os=linux sha256:4c09382245cf…error: could not compile `test_cargo` (bin <str>) due to 1 previous errorrust/rustc · compiler-diagnostic · outer cargo checkКачество данных: complete · Варианты среды: 1 · Первая запись: 2026-09-19 · Последнее наблюдение: 2026-09-19
-
наблюдалось PROJECT_COMPILE exit 101 E0433 ×1 2.0.20 os=linux sha256:963d5ad492f6…error[E0433]: cannot find `__private20` in `thiserror`rust/rustc · compiler-diagnostic · outer cargo checkКачество данных: complete · Варианты среды: 1 · Первая запись: 2026-09-19 · Последнее наблюдение: 2026-09-19
-
наблюдалось PROJECT_COMPILE exit 101 ×1 2.0.20 os=linux sha256:be5055744d31…error: could not compile `test_cargo` (bin <str>) due to 2 previous errorsrust/rustc · compiler-diagnostic · outer cargo runКачество данных: complete · Варианты среды: 1 · Первая запись: 2026-09-19 · Последнее наблюдение: 2026-09-19
-
наблюдалось PROJECT_COMPILE exit 101 E0432 ×1 2.0.20 os=linux sha256:dd2ae662f4db…error[E0432]: unresolved import `thiserror`rust/rustc · compiler-diagnostic · outer cargo runКачество данных: complete · Варианты среды: 1 · Первая запись: 2026-09-19 · Последнее наблюдение: 2026-09-19
-
наблюдалось PROJECT_COMPILE exit 101 E0599 ×1 2.0.20 os=linux sha256:f07bb2beb9ac…error[E0599]: no method named `as_display` found for reference `&String` in the current scoperust/rustc · compiler-diagnostic · outer cargo runКачество данных: complete · Варианты среды: 1 · Первая запись: 2026-09-19 · Последнее наблюдение: 2026-09-19