Relevéscargosyn3.0.5
Changer les conditions
Conditions actuelles
syn @3.0.5ubuntu glibc · x64 · cargo 1
total du paquet, pas une API
0 sur 1 ont réussi
Vérifié — ce réseau a exécuté un contrat à cette coordonnée.
il y a un échantillon ici et notre exécution à cette coordonnée a échoué
- Observations de projets
- 17 / 27
- Vérifications de contrat
- 0 / 1
- Enregistrements d'usage
- 2
- Pairs rapporteurs indépendants
- 1
- Dernier enregistrement
- 2026-09-16
Santé des dépendances
Combinaisons observées et preuves d'échec pour cette version
Premier échec observé
3.0.5
linux
1 FAIL
· stage: PROJECT_COMPILE
· fingerprint: sha256:4cea358679576b2487958ac4034dc10b763a092bf4d66041d30899a2beb10162
| Bibliothèque | Version | Santé | Mesuré là-bas | Projets |
|---|---|---|---|---|
| unicode-ident | 1.0.24 | CANDIDATE Changement corrélé; combinaison non prouvée | contrat réussi | 11 jours-projet |
| unicode-ident | 1.0.25 | CANDIDATE Changement corrélé; combinaison non prouvée | builds observés | 2 jours-projet |
| proc-macro2 | 1.0.107 | PASS Toutes les observations ont réussi | contrat réussi | 14 jours-projet |
| quote | 1.0.47 | PASS Toutes les observations ont réussi | contrat réussi | 14 jours-projet |
La colonne de mesure porte sur la version de chaque dépendance elle-même, pas sur la paire. Qu'un résolveur ait placé deux versions côte à côte ne prouve pas qu'elles fonctionnent ensemble.
Versions des dépendances au fil des versions
Ce vers quoi chaque version de ce paquet a résolu ses enfants. L'enfant dont la version a bougé vient en premier : c'est là qu'une mise à jour a changé quelque chose sous vos pieds.
| Bibliothèque | 3.0.6 | 3.0.5 | 3.0.3 | 2.0.119 |
|---|---|---|---|---|
| unicode-ident | 1.0.25 | 1.0.25 | 1.0.26 | 1.0.25 |
| proc-macro2 | 1.0.107 | 1.0.107 | 1.0.107 | 1.0.107 |
| quote | 1.0.47 | 1.0.47 | 1.0.47 | 1.0.47 |
Ont bougé : 1 · identiques à chaque version : 2
Une arête indique qu'un résolveur a placé une version à côté d'une autre sur une machine réelle. Ce n'est pas une affirmation qu'elles fonctionnent ensemble ; à cette question répondent les échantillons et les contrats, pas la présence d'une ligne.
Clusters d'échecs récents
-
observé PROJECT_COMPILE exit 101 E0433 ×1 3.0.5 os=linux sha256:4cea35867957…error[E0433]: cannot find `__private229` in `_serde` · error[E0433]: cannot find `Serializer` in `_serde` · error[E0433]: cannot find `ser` in `_serde`rust/rustc · compiler-diagnostic · outer cargo checkQualité de preuve: complete · Variantes d’environnement: 1 · Premier relevé: 2026-09-14 · Dernière observation: 2026-09-14
-
observé PROJECT_COMPILE exit 101 E0283 ×1 3.0.5 os=linux sha256:55052d6fc8b2…error[E0283]: type annotations neededrust/rustc · compiler-diagnostic · outer cargo runQualité de preuve: complete · Variantes d’environnement: 1 · Premier relevé: 2026-09-14 · Dernière observation: 2026-09-14
-
observé PROJECT_COMPILE exit 101 ×1 3.0.5 os=linux sha256:7461bf46226d…error: could not compile `sample-serde-core` (bin <str>) due to 3 previous errorsrust/rustc · compiler-diagnostic · outer cargo runQualité de preuve: complete · Variantes d’environnement: 1 · Premier relevé: 2026-09-14 · Dernière observation: 2026-09-14
-
observé PROJECT_COMPILE exit 101 E0405 ×1 3.0.5 os=linux sha256:8a1088019b07…error[E0405]: cannot find trait `Serialize` in module `_serde` · error[E0405]: cannot find trait `Serializer` in module `_serde`rust/rustc · compiler-diagnostic · outer cargo checkQualité de preuve: complete · Variantes d’environnement: 1 · Premier relevé: 2026-09-14 · Dernière observation: 2026-09-14
-
observé PROJECT_COMPILE exit 101 ×1 3.0.5 os=linux sha256:b21c095b1aba…error: could not compile `sample-serde-core` (bin <str>) due to 1 previous errorrust/rustc · compiler-diagnostic · outer cargo runQualité de preuve: complete · Variantes d’environnement: 1 · Premier relevé: 2026-09-14 · Dernière observation: 2026-09-14
-
observé PROJECT_COMPILE exit 101 ×1 3.0.5 os=linux sha256:df160d9ca814…error: could not compile `sample-serde-derive` (bin <str>) due to 7 previous errorsrust/rustc · compiler-diagnostic · outer cargo checkQualité de preuve: complete · Variantes d’environnement: 1 · Premier relevé: 2026-09-14 · Dernière observation: 2026-09-14
-
observé PROJECT_COMPILE exit 101 E0599 ×1 3.0.5 os=linux sha256:f713b890152f…error[E0599]: no method named `into_deserializer` found for enum `std::option::Option<T>` in the current scope …rust/rustc · compiler-diagnostic · outer cargo runQualité de preuve: complete · Variantes d’environnement: 1 · Premier relevé: 2026-09-14 · Dernière observation: 2026-09-14
-
observé UNKNOWN exit 101 Lacune de preuve ×1 3.0.5 os=linux sha256:eeb9864183a6…Compiling sample-serde-core v1.0.0 (<path> · Finished `dev` profile [unoptimized + debuginfo] target(s) in 0.27s · Running `target/debug/contract` …cargo · unclassified-diagnostic · outer cargo run · gap stage-unknownQualité de preuve: complete · Variantes d’environnement: 1 · Premier relevé: 2026-09-14 · Dernière observation: 2026-09-14Candidat à une revérification diagnostique
-
observé PROJECT_COMPILE exit 101 E0308 ×1 3.0.5 os=linux sha256:0479254218ac…error[E0308]: mismatched typesrust/rustc · compiler-diagnostic · outer cargo testQualité de preuve: complete · Variantes d’environnement: 1 · Premier relevé: 2026-09-16 · Dernière observation: 2026-09-16
-
observé PROJECT_COMPILE exit 101 E0433 ×1 3.0.5 os=linux sha256:76da7807743b…error[E0433]: cannot find `pin` in `tokio` · error[E0433]: cannot find `pin` in `tokio_macros_sample`rust/rustc · compiler-diagnostic · outer cargo testQualité de preuve: complete · Variantes d’environnement: 1 · Premier relevé: 2026-09-16 · Dernière observation: 2026-09-16
-
observé PROJECT_COMPILE exit 101 ×1 3.0.5 os=linux sha256:ddfcd6108cf7…error: could not compile `tokio_macros_sample` (test <str>) due to 6 previous errorsrust/rustc · compiler-diagnostic · outer cargo testQualité de preuve: complete · Variantes d’environnement: 1 · Premier relevé: 2026-09-16 · Dernière observation: 2026-09-16