Registroscargosyn3.0.5
Mudar as condições
Condições atuais
syn @3.0.5alpine musl · x64 · rust 1 · cargo · rust
total do pacote, não uma API
Registrado como presente em projetos. Nada foi executado nesta coordenada.
Observado — builds reais de projetos reportaram desta coordenada.
ainda sem amostra nesta coordenada
- Observações de projetos
- nada nesta coordenada
- Verificações de contrato
- nada nesta coordenada
- Registros de uso
- 2
- Peers independentes que reportaram
- 1
- Último registro
- 2026-09-16
Saúde das dependências
Combinações observadas e evidências de falha para esta versão
Primeira quebra observada
3.0.5
linux
1 FAIL
· stage: PROJECT_COMPILE
· fingerprint: sha256:4cea358679576b2487958ac4034dc10b763a092bf4d66041d30899a2beb10162
| Biblioteca | Versão | Saúde | Medido ali | Projetos |
|---|---|---|---|---|
| unicode-ident | 1.0.24 | CANDIDATE Mudança correlacionada; combinação não comprovada | contrato aprovado | 11 dias-projeto |
| unicode-ident | 1.0.25 | CANDIDATE Mudança correlacionada; combinação não comprovada | builds observados | 2 dias-projeto |
| proc-macro2 | 1.0.107 | PASS Todas as observações passaram | contrato aprovado | 14 dias-projeto |
| quote | 1.0.47 | PASS Todas as observações passaram | contrato aprovado | 14 dias-projeto |
A coluna de medição é sobre a versão de cada dependência em si, não sobre o par. Um resolvedor ter colocado duas versões lado a lado não é prova de que funcionam juntas.
Versões de dependências por versão
Para que cada versão deste pacote resolveu seus filhos. O filho cuja versão se moveu vem primeiro: foi ali que uma atualização mudou algo sob os seus pés.
| Biblioteca | 3.0.6 | 3.0.5 | 3.0.3 | 2.0.119 |
|---|---|---|---|---|
| unicode-ident | 1.0.25 | 1.0.25 | 1.0.26 | 1.0.25 |
| proc-macro2 | 1.0.107 | 1.0.107 | 1.0.107 | 1.0.107 |
| quote | 1.0.47 | 1.0.47 | 1.0.47 | 1.0.47 |
Moveram-se: 1 · iguais em todas as versões: 2
Uma aresta registra que um resolvedor colocou uma versão ao lado de outra em uma máquina real. Não é uma afirmação de que as duas funcionam juntas; essa pergunta é respondida por amostras e contratos, não pela presença de uma linha.
Clusters de falha recentes
-
observado PROJECT_COMPILE exit 101 E0433 ×1 3.0.5 os=linux sha256:4cea35867957…error[E0433]: cannot find `__private229` in `_serde` · error[E0433]: cannot find `Serializer` in `_serde` · error[E0433]: cannot find `ser` in `_serde`rust/rustc · compiler-diagnostic · outer cargo checkQualidade da evidência: complete · Variantes de ambiente: 1 · Primeiro registro: 2026-09-14 · Visto por último: 2026-09-14
-
observado PROJECT_COMPILE exit 101 E0283 ×1 3.0.5 os=linux sha256:55052d6fc8b2…error[E0283]: type annotations neededrust/rustc · compiler-diagnostic · outer cargo runQualidade da evidência: complete · Variantes de ambiente: 1 · Primeiro registro: 2026-09-14 · Visto por último: 2026-09-14
-
observado PROJECT_COMPILE exit 101 ×1 3.0.5 os=linux sha256:7461bf46226d…error: could not compile `sample-serde-core` (bin <str>) due to 3 previous errorsrust/rustc · compiler-diagnostic · outer cargo runQualidade da evidência: complete · Variantes de ambiente: 1 · Primeiro registro: 2026-09-14 · Visto por último: 2026-09-14
-
observado PROJECT_COMPILE exit 101 E0405 ×1 3.0.5 os=linux sha256:8a1088019b07…error[E0405]: cannot find trait `Serialize` in module `_serde` · error[E0405]: cannot find trait `Serializer` in module `_serde`rust/rustc · compiler-diagnostic · outer cargo checkQualidade da evidência: complete · Variantes de ambiente: 1 · Primeiro registro: 2026-09-14 · Visto por último: 2026-09-14
-
observado PROJECT_COMPILE exit 101 ×1 3.0.5 os=linux sha256:b21c095b1aba…error: could not compile `sample-serde-core` (bin <str>) due to 1 previous errorrust/rustc · compiler-diagnostic · outer cargo runQualidade da evidência: complete · Variantes de ambiente: 1 · Primeiro registro: 2026-09-14 · Visto por último: 2026-09-14
-
observado PROJECT_COMPILE exit 101 ×1 3.0.5 os=linux sha256:df160d9ca814…error: could not compile `sample-serde-derive` (bin <str>) due to 7 previous errorsrust/rustc · compiler-diagnostic · outer cargo checkQualidade da evidência: complete · Variantes de ambiente: 1 · Primeiro registro: 2026-09-14 · Visto por último: 2026-09-14
-
observado PROJECT_COMPILE exit 101 E0599 ×1 3.0.5 os=linux sha256:f713b890152f…error[E0599]: no method named `into_deserializer` found for enum `std::option::Option<T>` in the current scope …rust/rustc · compiler-diagnostic · outer cargo runQualidade da evidência: complete · Variantes de ambiente: 1 · Primeiro registro: 2026-09-14 · Visto por último: 2026-09-14
-
observado UNKNOWN exit 101 Lacuna de evidência ×1 3.0.5 os=linux sha256:eeb9864183a6…Compiling sample-serde-core v1.0.0 (<path> · Finished `dev` profile [unoptimized + debuginfo] target(s) in 0.27s · Running `target/debug/contract` …cargo · unclassified-diagnostic · outer cargo run · gap stage-unknownQualidade da evidência: complete · Variantes de ambiente: 1 · Primeiro registro: 2026-09-14 · Visto por último: 2026-09-14Candidato a reverificação diagnóstica
-
observado PROJECT_COMPILE exit 101 E0308 ×1 3.0.5 os=linux sha256:0479254218ac…error[E0308]: mismatched typesrust/rustc · compiler-diagnostic · outer cargo testQualidade da evidência: complete · Variantes de ambiente: 1 · Primeiro registro: 2026-09-16 · Visto por último: 2026-09-16
-
observado PROJECT_COMPILE exit 101 E0433 ×1 3.0.5 os=linux sha256:76da7807743b…error[E0433]: cannot find `pin` in `tokio` · error[E0433]: cannot find `pin` in `tokio_macros_sample`rust/rustc · compiler-diagnostic · outer cargo testQualidade da evidência: complete · Variantes de ambiente: 1 · Primeiro registro: 2026-09-16 · Visto por último: 2026-09-16
-
observado PROJECT_COMPILE exit 101 ×1 3.0.5 os=linux sha256:ddfcd6108cf7…error: could not compile `tokio_macros_sample` (test <str>) due to 6 previous errorsrust/rustc · compiler-diagnostic · outer cargo testQualidade da evidência: complete · Variantes de ambiente: 1 · Primeiro registro: 2026-09-16 · Visto por último: 2026-09-16