기록cargosyn3.0.5
조건 변경
현재 조건
syn @3.0.5ubuntu glibc · x64 · cargo 1
API가 아니라 패키지 전체 집계
1회 중 0회 통과
검증 — 이 네트워크가 이 좌표에서 컨트랙트를 직접 실행했습니다.
샘플 있음 — 이 좌표에서 우리가 실행했고 실패함
- 프로젝트 관측
- 17 / 27
- 컨트랙트 검증
- 0 / 1
- 사용 기록
- 2
- 독립 보고 peer
- 1
- 마지막 기록
- 2026-09-16
열어 볼 수 있는 증거
의존성 건강도
이 릴리스의 의존성 조합과 실패 관측 결과
관측된 문제 1건 ·
변경 2건 ·
정상 2건
| 라이브러리 | 버전 | 건강도 | 그 좌표에서 측정된 것 | 프로젝트 |
|---|---|---|---|---|
| unicode-ident | 1.0.24 | CANDIDATE 상관 변경; 조합 결과 미증명 | 컨트랙트 통과 | 프로젝트-일 11개 |
| unicode-ident | 1.0.25 | CANDIDATE 상관 변경; 조합 결과 미증명 | 빌드 관측됨 | 프로젝트-일 2개 |
| proc-macro2 | 1.0.107 | PASS 모든 관측 정상 통과 | 컨트랙트 통과 | 프로젝트-일 14개 |
| quote | 1.0.47 | PASS 모든 관측 정상 통과 | 컨트랙트 통과 | 프로젝트-일 14개 |
측정 열은 각 의존성 자신의 릴리스에 대한 것이지 두 릴리스의 조합에 대한 것이 아닙니다. 리졸버가 둘을 나란히 놓았다는 사실은 함께 동작한다는 증거가 아닙니다.
릴리스별 의존성 버전
이 패키지의 릴리스마다 자식이 어떤 버전으로 해석됐는지입니다. 버전이 움직인 자식이 먼저 나옵니다 — 업그레이드가 발밑에서 무언가를 바꾼 지점입니다.
| 라이브러리 | 3.0.6 | 3.0.5 | 3.0.3 | 2.0.119 |
|---|---|---|---|---|
| unicode-ident | 1.0.25 | 1.0.25 | 1.0.26 | 1.0.25 |
| proc-macro2 | 1.0.107 | 1.0.107 | 1.0.107 | 1.0.107 |
| quote | 1.0.47 | 1.0.47 | 1.0.47 | 1.0.47 |
움직임: 1 · 모든 릴리스에서 동일: 2
엣지는 실제 기계에서 리졸버가 한 릴리스를 다른 릴리스 옆에 놓았다는 기록입니다. 둘이 함께 동작한다는 주장이 아닙니다. 그 질문은 여기 행이 있다는 사실이 아니라 샘플과 컨트랙트가 답합니다.
최근 실패 클러스터
-
관측됨 PROJECT_COMPILE exit 101 E0433 ×1 3.0.5 os=linux sha256:4cea35867957…error[E0433]: cannot find `__private229` in `_serde` · error[E0433]: cannot find `Serializer` in `_serde` · error[E0433]: cannot find `ser` in `_serde`rust/rustc · compiler-diagnostic · outer cargo check증거 품질: complete · 환경 변형: 1 · 최초 관측: 2026-09-14 · 마지막 관측: 2026-09-14
-
관측됨 PROJECT_COMPILE exit 101 E0283 ×1 3.0.5 os=linux sha256:55052d6fc8b2…error[E0283]: type annotations neededrust/rustc · compiler-diagnostic · outer cargo run증거 품질: complete · 환경 변형: 1 · 최초 관측: 2026-09-14 · 마지막 관측: 2026-09-14
-
관측됨 PROJECT_COMPILE exit 101 ×1 3.0.5 os=linux sha256:7461bf46226d…error: could not compile `sample-serde-core` (bin <str>) due to 3 previous errorsrust/rustc · compiler-diagnostic · outer cargo run증거 품질: complete · 환경 변형: 1 · 최초 관측: 2026-09-14 · 마지막 관측: 2026-09-14
-
관측됨 PROJECT_COMPILE exit 101 E0405 ×1 3.0.5 os=linux sha256:8a1088019b07…error[E0405]: cannot find trait `Serialize` in module `_serde` · error[E0405]: cannot find trait `Serializer` in module `_serde`rust/rustc · compiler-diagnostic · outer cargo check증거 품질: complete · 환경 변형: 1 · 최초 관측: 2026-09-14 · 마지막 관측: 2026-09-14
-
관측됨 PROJECT_COMPILE exit 101 ×1 3.0.5 os=linux sha256:b21c095b1aba…error: could not compile `sample-serde-core` (bin <str>) due to 1 previous errorrust/rustc · compiler-diagnostic · outer cargo run증거 품질: complete · 환경 변형: 1 · 최초 관측: 2026-09-14 · 마지막 관측: 2026-09-14
-
관측됨 PROJECT_COMPILE exit 101 ×1 3.0.5 os=linux sha256:df160d9ca814…error: could not compile `sample-serde-derive` (bin <str>) due to 7 previous errorsrust/rustc · compiler-diagnostic · outer cargo check증거 품질: complete · 환경 변형: 1 · 최초 관측: 2026-09-14 · 마지막 관측: 2026-09-14
-
관측됨 PROJECT_COMPILE exit 101 E0599 ×1 3.0.5 os=linux sha256:f713b890152f…error[E0599]: no method named `into_deserializer` found for enum `std::option::Option<T>` in the current scope …rust/rustc · compiler-diagnostic · outer cargo run증거 품질: complete · 환경 변형: 1 · 최초 관측: 2026-09-14 · 마지막 관측: 2026-09-14
-
관측됨 UNKNOWN exit 101 증거 공백 ×1 3.0.5 os=linux sha256:eeb9864183a6…Compiling sample-serde-core v1.0.0 (<path> · Finished `dev` profile [unoptimized + debuginfo] target(s) in 0.27s · Running `target/debug/contract` …cargo · unclassified-diagnostic · outer cargo run · gap stage-unknown증거 품질: complete · 환경 변형: 1 · 최초 관측: 2026-09-14 · 마지막 관측: 2026-09-14진단 재검증 후보
-
관측됨 PROJECT_COMPILE exit 101 E0308 ×1 3.0.5 os=linux sha256:0479254218ac…error[E0308]: mismatched typesrust/rustc · compiler-diagnostic · outer cargo test증거 품질: complete · 환경 변형: 1 · 최초 관측: 2026-09-16 · 마지막 관측: 2026-09-16
-
관측됨 PROJECT_COMPILE exit 101 E0433 ×1 3.0.5 os=linux sha256:76da7807743b…error[E0433]: cannot find `pin` in `tokio` · error[E0433]: cannot find `pin` in `tokio_macros_sample`rust/rustc · compiler-diagnostic · outer cargo test증거 품질: complete · 환경 변형: 1 · 최초 관측: 2026-09-16 · 마지막 관측: 2026-09-16
-
관측됨 PROJECT_COMPILE exit 101 ×1 3.0.5 os=linux sha256:ddfcd6108cf7…error: could not compile `tokio_macros_sample` (test <str>) due to 6 previous errorsrust/rustc · compiler-diagnostic · outer cargo test증거 품질: complete · 환경 변형: 1 · 최초 관측: 2026-09-16 · 마지막 관측: 2026-09-16