Registroscargosyn3.0.9
Mudar as condições
Condições atuais
syn @3.0.9alpine musl · x64 · rust 1 · cargo · rust
total do pacote, não uma API
Registrado como presente em projetos. Nada foi executado nesta coordenada.
Observado — builds reais de projetos reportaram desta coordenada.
ainda sem amostra nesta coordenada
- Observações de projetos
- nada nesta coordenada
- Verificações de contrato
- nada nesta coordenada
- Registros de uso
- 5
- Peers independentes que reportaram
- 1
- Último registro
- 2026-10-22
Saúde das dependências
Combinações observadas e evidências de falha para esta versão
Primeira quebra observada
3.0.9
linux
9 FAIL
· stage: PROJECT_COMPILE
· fingerprint: sha256:b07a18e8da2b85db79ae94f57f091cb6ea8358f16310795caf813cf41867ab8a
| Biblioteca | Versão | Saúde | Medido ali | Projetos |
|---|---|---|---|---|
| unicode-ident | 1.0.27 | CANDIDATE Mudança correlacionada; combinação não comprovada | contrato aprovado | 51 dias-projeto |
| proc-macro2 | 1.0.107 | PASS Todas as observações passaram | contrato aprovado | 52 dias-projeto |
| quote | 1.0.47 | PASS Todas as observações passaram | contrato aprovado | 52 dias-projeto |
A coluna de medição é sobre a versão de cada dependência em si, não sobre o par. Um resolvedor ter colocado duas versões lado a lado não é prova de que funcionam juntas.
Versões de dependências por versão
Para que cada versão deste pacote resolveu seus filhos. O filho cuja versão se moveu vem primeiro: foi ali que uma atualização mudou algo sob os seus pés.
| Biblioteca | 3.0.9 | 3.0.7 | 3.0.6 | 3.0.5 | 3.0.3 | 2.0.119 |
|---|---|---|---|---|---|---|
| unicode-ident | 1.0.27 | 1.0.26 | 1.0.25 | 1.0.25 | 1.0.26 | 1.0.25 |
| proc-macro2 | 1.0.107 | 1.0.107 | 1.0.107 | 1.0.107 | 1.0.107 | 1.0.107 |
| quote | 1.0.47 | 1.0.47 | 1.0.47 | 1.0.47 | 1.0.47 | 1.0.47 |
Moveram-se: 1 · iguais em todas as versões: 2
Uma aresta registra que um resolvedor colocou uma versão ao lado de outra em uma máquina real. Não é uma afirmação de que as duas funcionam juntas; essa pergunta é respondida por amostras e contratos, não pela presença de uma linha.
Clusters de falha recentes
-
observado PROJECT_COMPILE exit 101 E0599 ×9 3.0.9 os=linux sha256:b07a18e8da2b…error[E0599]: no associated function or constant named `new` found for struct `Adapter` in the current scoperust/rustc · compiler-diagnostic · outer cargo build, cargo check, cargo run, cargo testQualidade da evidência: complete · Variantes de ambiente: 1 · Primeiro registro: 2026-10-19 · Visto por último: 2026-10-21
-
observado PROJECT_COMPILE exit 101 E0308 ×4 3.0.5 → 3.0.6 → 3.0.9 os=linux sha256:0479254218ac…error[E0308]: mismatched typesrust/rustc · compiler-diagnostic · outer cargo run, cargo testQualidade da evidência: complete · Variantes de ambiente: 1 · Primeiro registro: 2026-09-16 · Visto por último: 2026-10-21
-
observado PROJECT_COMPILE exit 101 ×4 3.0.9 os=linux sha256:4c786cbbce8a…error: could not compile `sample` (bin <str>) due to 1 previous errorrust/rustc · compiler-diagnostic · outer cargo runQualidade da evidência: complete · Variantes de ambiente: 1 · Primeiro registro: 2026-10-21 · Visto por último: 2026-10-21
-
observado PROJECT_COMPILE exit 101 ×3 3.0.9 os=linux sha256:6d7f0ce8254c…error: could not compile `sample-idna-adapter` (bin <str>) due to 1 previous errorrust/rustc · compiler-diagnostic · outer cargo build, cargo checkQualidade da evidência: complete · Variantes de ambiente: 1 · Primeiro registro: 2026-10-19 · Visto por último: 2026-10-21
-
observado UNKNOWN exit 101 Lacuna de evidência ×2 3.0.9 os=linux sha256:8f78f52362b8…Updating crates.io index · Locking 7 packages to latest compatible versions · Adding wasm-bindgen-macro-support v0.2.128 (available: v0.2.129) …cargo · unclassified-diagnostic · outer cargo run · gap stage-unknownQualidade da evidência: complete · Variantes de ambiente: 1 · Primeiro registro: 2026-10-17 · Visto por último: 2026-10-17Candidato a reverificação diagnóstica
-
observado PROJECT_COMPILE exit 101 ×1 3.0.9 os=linux sha256:92ea19e5526e…error: could not compile `sample-expand-class-marker` (bin <str>) due to 1 previous errorrust/rustc · compiler-diagnostic · outer cargo runQualidade da evidência: complete · Variantes de ambiente: 1 · Primeiro registro: 2026-10-17 · Visto por último: 2026-10-17
-
observado PROJECT_COMPILE exit 101 E0599 ×1 3.0.9 os=linux sha256:eaa7d8163513…error[E0599]: no method named `into_node` found for struct `wasm_bindgen_macro_support::error::Diagnostic` in the current scoperust/rustc · compiler-diagnostic · outer cargo runQualidade da evidência: complete · Variantes de ambiente: 1 · Primeiro registro: 2026-10-17 · Visto por último: 2026-10-17
-
observado UNKNOWN signal ABORTED Lacuna de evidência ×1 3.0.9 os=linux sha256:034c59ed23d6…Compiling sample-wasm-bindgen v0.1.0 (<path> · Finished `dev` profile [unoptimized + debuginfo] target(s) in 0.19s …cargo · unclassified-diagnostic · outer cargo run · gap stage-unknownQualidade da evidência: complete · Variantes de ambiente: 1 · Primeiro registro: 2026-10-17 · Visto por último: 2026-10-17Candidato a reverificação diagnóstica
-
observado UNKNOWN exit 101 Lacuna de evidência ×1 3.0.9 os=linux sha256:38c7f7eae057…Compiling sample-expand-class-marker v0.1.0 (<path> · Finished `dev` profile [unoptimized + debuginfo] target(s) in 1.03s …cargo · unclassified-diagnostic · outer cargo run · gap stage-unknownQualidade da evidência: complete · Variantes de ambiente: 1 · Primeiro registro: 2026-10-17 · Visto por último: 2026-10-17Candidato a reverificação diagnóstica
-
observado UNKNOWN exit 101 Lacuna de evidência ×1 3.0.9 os=linux sha256:3cad07d3a07c…Compiling sample-wasm-bindgen-macro-support v0.1.0 (<path> · Finished `dev` profile [unoptimized + debuginfo] target(s) in 0.53s …cargo · unclassified-diagnostic · outer cargo run · gap stage-unknownQualidade da evidência: complete · Variantes de ambiente: 1 · Primeiro registro: 2026-10-17 · Visto por último: 2026-10-17Candidato a reverificação diagnóstica
-
observado UNKNOWN exit 101 Lacuna de evidência ×1 3.0.9 os=linux sha256:49fbc1f03025…Compiling sample-wasm-bindgen v0.1.0 (<path> · Finished `dev` profile [unoptimized + debuginfo] target(s) in 0.33s …cargo · unclassified-diagnostic · outer cargo run · gap stage-unknownQualidade da evidência: complete · Variantes de ambiente: 1 · Primeiro registro: 2026-10-17 · Visto por último: 2026-10-17Candidato a reverificação diagnóstica
-
observado UNKNOWN exit 101 Lacuna de evidência ×1 3.0.9 os=linux sha256:ce88fa682bac…Updating crates.io index · Locking 12 packages to latest compatible versions · Adding wasm-bindgen v0.2.128 (available: v0.2.129) …cargo · unclassified-diagnostic · outer cargo run · gap stage-unknownQualidade da evidência: complete · Variantes de ambiente: 1 · Primeiro registro: 2026-10-17 · Visto por último: 2026-10-17Candidato a reverificação diagnóstica
Mostrando os 12 mais relatados de 23 grupos de falhas registrados. O resto são relatos únicos.