Aufzeichnungencargosyn3.0.5
Bedingungen ändern
Aktuelle Bedingungen
syn @3.0.5alpine musl · x64 · rust 1 · cargo · rust
Paketsumme, keine API
Als in Projekten vorhanden erfasst. An dieser Koordinate wurde nichts ausgeführt.
Beobachtet — echte Projekt-Builds haben von dieser Koordinate berichtet.
an dieser Koordinate noch kein Sample
- Projektbeobachtungen
- nichts an dieser Koordinate
- Contract-Verifikationen
- nichts an dieser Koordinate
- Nutzungsdatensätze
- 2
- Unabhängig meldende Peers
- 1
- Zuletzt erfasst
- 2026-09-16
Abhängigkeits-Zustand
Beobachtete Kombinationen und Fehlernachweise für dieses Release
Erster beobachteter Fehler
3.0.5
linux
1 FAIL
· stage: PROJECT_COMPILE
· fingerprint: sha256:4cea358679576b2487958ac4034dc10b763a092bf4d66041d30899a2beb10162
| Bibliothek | Version | Zustand | Dort gemessen | Projekte |
|---|---|---|---|---|
| unicode-ident | 1.0.24 | CANDIDATE Korrelierte Änderung; unbewiesene Kombination | Contract bestanden | 11 Projekttage |
| unicode-ident | 1.0.25 | CANDIDATE Korrelierte Änderung; unbewiesene Kombination | Builds beobachtet | 2 Projekttage |
| proc-macro2 | 1.0.107 | PASS Alle Beobachtungen bestanden | Contract bestanden | 14 Projekttage |
| quote | 1.0.47 | PASS Alle Beobachtungen bestanden | Contract bestanden | 14 Projekttage |
Die Messspalte betrifft das Release der jeweiligen Abhängigkeit selbst, nicht das Paar. Dass ein Resolver zwei Releases nebeneinandergestellt hat, ist kein Beleg dafür, dass sie zusammen funktionieren.
Abhängigkeitsversionen über Releases
Worauf jedes Release dieses Pakets seine Kinder aufgelöst hat. Ein Kind, dessen Version sich bewegt hat, steht zuerst: dort hat ein Upgrade etwas unter Ihnen verändert.
| Bibliothek | 3.0.6 | 3.0.5 | 3.0.3 | 2.0.119 |
|---|---|---|---|---|
| unicode-ident | 1.0.25 | 1.0.25 | 1.0.26 | 1.0.25 |
| proc-macro2 | 1.0.107 | 1.0.107 | 1.0.107 | 1.0.107 |
| quote | 1.0.47 | 1.0.47 | 1.0.47 | 1.0.47 |
Bewegt: 1 · in jedem Release gleich: 2
Eine Kante hält fest, dass ein Resolver auf einer echten Maschine ein Release neben ein anderes gestellt hat. Sie behauptet nicht, dass beide zusammen funktionieren; diese Frage beantworten Samples und Contracts, nicht das Vorhandensein einer Zeile.
Aktuelle Fehler-Cluster
-
beobachtet PROJECT_COMPILE exit 101 E0433 ×1 3.0.5 os=linux sha256:4cea35867957…error[E0433]: cannot find `__private229` in `_serde` · error[E0433]: cannot find `Serializer` in `_serde` · error[E0433]: cannot find `ser` in `_serde`rust/rustc · compiler-diagnostic · outer cargo checkBeweisqualität: complete · Umgebungsvarianten: 1 · Zuerst erfasst: 2026-09-14 · Zuletzt gesehen: 2026-09-14
-
beobachtet PROJECT_COMPILE exit 101 E0283 ×1 3.0.5 os=linux sha256:55052d6fc8b2…error[E0283]: type annotations neededrust/rustc · compiler-diagnostic · outer cargo runBeweisqualität: complete · Umgebungsvarianten: 1 · Zuerst erfasst: 2026-09-14 · Zuletzt gesehen: 2026-09-14
-
beobachtet PROJECT_COMPILE exit 101 ×1 3.0.5 os=linux sha256:7461bf46226d…error: could not compile `sample-serde-core` (bin <str>) due to 3 previous errorsrust/rustc · compiler-diagnostic · outer cargo runBeweisqualität: complete · Umgebungsvarianten: 1 · Zuerst erfasst: 2026-09-14 · Zuletzt gesehen: 2026-09-14
-
beobachtet PROJECT_COMPILE exit 101 E0405 ×1 3.0.5 os=linux sha256:8a1088019b07…error[E0405]: cannot find trait `Serialize` in module `_serde` · error[E0405]: cannot find trait `Serializer` in module `_serde`rust/rustc · compiler-diagnostic · outer cargo checkBeweisqualität: complete · Umgebungsvarianten: 1 · Zuerst erfasst: 2026-09-14 · Zuletzt gesehen: 2026-09-14
-
beobachtet PROJECT_COMPILE exit 101 ×1 3.0.5 os=linux sha256:b21c095b1aba…error: could not compile `sample-serde-core` (bin <str>) due to 1 previous errorrust/rustc · compiler-diagnostic · outer cargo runBeweisqualität: complete · Umgebungsvarianten: 1 · Zuerst erfasst: 2026-09-14 · Zuletzt gesehen: 2026-09-14
-
beobachtet PROJECT_COMPILE exit 101 ×1 3.0.5 os=linux sha256:df160d9ca814…error: could not compile `sample-serde-derive` (bin <str>) due to 7 previous errorsrust/rustc · compiler-diagnostic · outer cargo checkBeweisqualität: complete · Umgebungsvarianten: 1 · Zuerst erfasst: 2026-09-14 · Zuletzt gesehen: 2026-09-14
-
beobachtet PROJECT_COMPILE exit 101 E0599 ×1 3.0.5 os=linux sha256:f713b890152f…error[E0599]: no method named `into_deserializer` found for enum `std::option::Option<T>` in the current scope …rust/rustc · compiler-diagnostic · outer cargo runBeweisqualität: complete · Umgebungsvarianten: 1 · Zuerst erfasst: 2026-09-14 · Zuletzt gesehen: 2026-09-14
-
beobachtet UNKNOWN exit 101 Beweislücke ×1 3.0.5 os=linux sha256:eeb9864183a6…Compiling sample-serde-core v1.0.0 (<path> · Finished `dev` profile [unoptimized + debuginfo] target(s) in 0.27s · Running `target/debug/contract` …cargo · unclassified-diagnostic · outer cargo run · gap stage-unknownBeweisqualität: complete · Umgebungsvarianten: 1 · Zuerst erfasst: 2026-09-14 · Zuletzt gesehen: 2026-09-14Kandidat für diagnostische Neuprüfung
-
beobachtet PROJECT_COMPILE exit 101 E0308 ×1 3.0.5 os=linux sha256:0479254218ac…error[E0308]: mismatched typesrust/rustc · compiler-diagnostic · outer cargo testBeweisqualität: complete · Umgebungsvarianten: 1 · Zuerst erfasst: 2026-09-16 · Zuletzt gesehen: 2026-09-16
-
beobachtet PROJECT_COMPILE exit 101 E0433 ×1 3.0.5 os=linux sha256:76da7807743b…error[E0433]: cannot find `pin` in `tokio` · error[E0433]: cannot find `pin` in `tokio_macros_sample`rust/rustc · compiler-diagnostic · outer cargo testBeweisqualität: complete · Umgebungsvarianten: 1 · Zuerst erfasst: 2026-09-16 · Zuletzt gesehen: 2026-09-16
-
beobachtet PROJECT_COMPILE exit 101 ×1 3.0.5 os=linux sha256:ddfcd6108cf7…error: could not compile `tokio_macros_sample` (test <str>) due to 6 previous errorsrust/rustc · compiler-diagnostic · outer cargo testBeweisqualität: complete · Umgebungsvarianten: 1 · Zuerst erfasst: 2026-09-16 · Zuletzt gesehen: 2026-09-16