記録cargosyn3.0.5
条件を変更
現在の条件
syn @3.0.5alpine musl · x64 · rust 1 · cargo · rust
API ではなくパッケージ全体の合計
プロジェクトに存在した記録のみです。この座標で実行されたものはありません。
観測 — 実際のプロジェクトのビルドがこの座標から報告されました。
この座標にはまだサンプルがない
- プロジェクト観測
- この座標にはなし
- コントラクト検証
- この座標にはなし
- 使用記録
- 2
- 独立した報告ピア
- 1
- 最終記録
- 2026-09-16
開ける証拠
依存関係のヘルス
このリリースの依存関係の組み合わせと失敗観測
観測された問題 1件 ·
変更 2件 ·
正常 2件
| ライブラリ | バージョン | ヘルス | その座標で測定されたこと | プロジェクト |
|---|---|---|---|---|
| unicode-ident | 1.0.24 | CANDIDATE 相関変更; 組み合わせ未証明 | コントラクト合格 | プロジェクト日 11 件 |
| unicode-ident | 1.0.25 | CANDIDATE 相関変更; 組み合わせ未証明 | ビルド観測済み | プロジェクト日 2 件 |
| proc-macro2 | 1.0.107 | PASS すべての観測で成功 | コントラクト合格 | プロジェクト日 14 件 |
| quote | 1.0.47 | PASS すべての観測で成功 | コントラクト合格 | プロジェクト日 14 件 |
測定列は各依存関係自身のリリースに関するもので、2つのリリースの組み合わせに関するものではありません。リゾルバが2つを並べたという事実は、両者が協調して動く証拠ではありません。
リリースごとの依存バージョン
このパッケージの各リリースが子をどのバージョンに解決したかです。バージョンが動いた子が先に並びます — アップグレードが足元で何かを変えた地点です。
| ライブラリ | 3.0.6 | 3.0.5 | 3.0.3 | 2.0.119 |
|---|---|---|---|---|
| unicode-ident | 1.0.25 | 1.0.25 | 1.0.26 | 1.0.25 |
| proc-macro2 | 1.0.107 | 1.0.107 | 1.0.107 | 1.0.107 |
| quote | 1.0.47 | 1.0.47 | 1.0.47 | 1.0.47 |
変動: 1 · 全リリースで同一: 2
エッジは、実機でリゾルバがあるリリースを別のリリースの隣に置いたという記録です。両者が一緒に動くという主張ではありません。その問いに答えるのは、ここに行があることではなくサンプルと契約です。
最近の失敗クラスター
-
観測済み PROJECT_COMPILE exit 101 E0433 ×1 3.0.5 os=linux sha256:4cea35867957…error[E0433]: cannot find `__private229` in `_serde` · error[E0433]: cannot find `Serializer` in `_serde` · error[E0433]: cannot find `ser` in `_serde`rust/rustc · compiler-diagnostic · outer cargo check証拠品質: complete · 環境バリアント: 1 · 初回記録: 2026-09-14 · 最終観測: 2026-09-14
-
観測済み PROJECT_COMPILE exit 101 E0283 ×1 3.0.5 os=linux sha256:55052d6fc8b2…error[E0283]: type annotations neededrust/rustc · compiler-diagnostic · outer cargo run証拠品質: complete · 環境バリアント: 1 · 初回記録: 2026-09-14 · 最終観測: 2026-09-14
-
観測済み PROJECT_COMPILE exit 101 ×1 3.0.5 os=linux sha256:7461bf46226d…error: could not compile `sample-serde-core` (bin <str>) due to 3 previous errorsrust/rustc · compiler-diagnostic · outer cargo run証拠品質: complete · 環境バリアント: 1 · 初回記録: 2026-09-14 · 最終観測: 2026-09-14
-
観測済み PROJECT_COMPILE exit 101 E0405 ×1 3.0.5 os=linux sha256:8a1088019b07…error[E0405]: cannot find trait `Serialize` in module `_serde` · error[E0405]: cannot find trait `Serializer` in module `_serde`rust/rustc · compiler-diagnostic · outer cargo check証拠品質: complete · 環境バリアント: 1 · 初回記録: 2026-09-14 · 最終観測: 2026-09-14
-
観測済み PROJECT_COMPILE exit 101 ×1 3.0.5 os=linux sha256:b21c095b1aba…error: could not compile `sample-serde-core` (bin <str>) due to 1 previous errorrust/rustc · compiler-diagnostic · outer cargo run証拠品質: complete · 環境バリアント: 1 · 初回記録: 2026-09-14 · 最終観測: 2026-09-14
-
観測済み PROJECT_COMPILE exit 101 ×1 3.0.5 os=linux sha256:df160d9ca814…error: could not compile `sample-serde-derive` (bin <str>) due to 7 previous errorsrust/rustc · compiler-diagnostic · outer cargo check証拠品質: complete · 環境バリアント: 1 · 初回記録: 2026-09-14 · 最終観測: 2026-09-14
-
観測済み PROJECT_COMPILE exit 101 E0599 ×1 3.0.5 os=linux sha256:f713b890152f…error[E0599]: no method named `into_deserializer` found for enum `std::option::Option<T>` in the current scope …rust/rustc · compiler-diagnostic · outer cargo run証拠品質: complete · 環境バリアント: 1 · 初回記録: 2026-09-14 · 最終観測: 2026-09-14
-
観測済み UNKNOWN exit 101 証拠の欠落 ×1 3.0.5 os=linux sha256:eeb9864183a6…Compiling sample-serde-core v1.0.0 (<path> · Finished `dev` profile [unoptimized + debuginfo] target(s) in 0.27s · Running `target/debug/contract` …cargo · unclassified-diagnostic · outer cargo run · gap stage-unknown証拠品質: complete · 環境バリアント: 1 · 初回記録: 2026-09-14 · 最終観測: 2026-09-14診断再検証候補
-
観測済み PROJECT_COMPILE exit 101 E0308 ×1 3.0.5 os=linux sha256:0479254218ac…error[E0308]: mismatched typesrust/rustc · compiler-diagnostic · outer cargo test証拠品質: complete · 環境バリアント: 1 · 初回記録: 2026-09-16 · 最終観測: 2026-09-16
-
観測済み PROJECT_COMPILE exit 101 E0433 ×1 3.0.5 os=linux sha256:76da7807743b…error[E0433]: cannot find `pin` in `tokio` · error[E0433]: cannot find `pin` in `tokio_macros_sample`rust/rustc · compiler-diagnostic · outer cargo test証拠品質: complete · 環境バリアント: 1 · 初回記録: 2026-09-16 · 最終観測: 2026-09-16
-
観測済み PROJECT_COMPILE exit 101 ×1 3.0.5 os=linux sha256:ddfcd6108cf7…error: could not compile `tokio_macros_sample` (test <str>) due to 6 previous errorsrust/rustc · compiler-diagnostic · outer cargo test証拠品質: complete · 環境バリアント: 1 · 初回記録: 2026-09-16 · 最終観測: 2026-09-16