기록cargosmallvec1.16.3
조건 변경
현재 조건
smallvec @1.16.3ubuntu glibc · x64 · cargo 1
API가 아니라 패키지 전체 집계
31회 중 19회 통과
관측 — 실제 프로젝트 빌드가 이 좌표에서 보고되었습니다.
이 좌표에는 아직 샘플이 없음
- 프로젝트 관측
- 19 / 31
- 컨트랙트 검증
- 이 좌표에는 없음
- 사용 기록
- 1
- 독립 보고 peer
- 1
- 마지막 기록
- 2026-10-20
열어 볼 수 있는 증거
의존성 건강도
어떤 해결 과정이 이 릴리스의 트리를 읽었고 의존성이 없었습니다. 빠진 것이 아니라 측정된 것입니다.
최근 실패 클러스터
-
관측됨 PROJECT_TEST exit 101 ×2 1.16.3 os=linux sha256:4f232600c5a8…error: test failed, to rerun pass `--test contract` · running 0 tests …rust/test · test-runner-diagnostic · outer cargo test증거 품질: complete · 환경 변형: 1 · 최초 관측: 2026-10-20 · 마지막 관측: 2026-10-20
-
관측됨 PROJECT_COMPILE exit 101 ×1 1.16.3 os=linux sha256:5f8e4e2b88b7…error: could not compile `sample-idna-adapter` (bin <str>) due to 2 previous errorsrust/rustc · compiler-diagnostic · outer cargo run증거 품질: complete · 환경 변형: 1 · 최초 관측: 2026-10-19 · 마지막 관측: 2026-10-19
-
관측됨 PROJECT_COMPILE exit 101 E0599 ×1 1.16.3 os=linux sha256:c2fafad2bab2…error[E0599]: no method named `is_rtl` found for struct `BidiClass` in the current scoperust/rustc · compiler-diagnostic · outer cargo run증거 품질: complete · 환경 변형: 1 · 최초 관측: 2026-10-19 · 마지막 관측: 2026-10-19
-
관측됨 PROJECT_COMPILE exit 101 ×1 1.16.3 os=linux sha256:6d7f0ce8254c…error: could not compile `sample-idna-adapter` (bin <str>) due to 1 previous errorrust/rustc · compiler-diagnostic · outer cargo build증거 품질: complete · 환경 변형: 1 · 최초 관측: 2026-10-19 · 마지막 관측: 2026-10-19
-
관측됨 PROJECT_COMPILE exit 101 E0599 ×1 1.16.3 os=linux sha256:b07a18e8da2b…error[E0599]: no associated function or constant named `new` found for struct `Adapter` in the current scoperust/rustc · compiler-diagnostic · outer cargo build증거 품질: complete · 환경 변형: 1 · 최초 관측: 2026-10-19 · 마지막 관측: 2026-10-19
-
관측됨 PROJECT_COMPILE exit 101 ×1 1.16.3 os=linux sha256:aaf1990e27c5…error: could not compile `sample-addr2line` (test <str>) due to 2 previous errors …rust/rustc · compiler-diagnostic · outer cargo test증거 품질: complete · 환경 변형: 1 · 최초 관측: 2026-10-19 · 마지막 관측: 2026-10-19
-
관측됨 PROJECT_COMPILE exit 101 E0432 ×1 1.16.3 os=linux sha256:ac7324fdd333…error[E0432]: unresolved import `addr2line::object`rust/rustc · compiler-diagnostic · outer cargo test증거 품질: complete · 환경 변형: 1 · 최초 관측: 2026-10-19 · 마지막 관측: 2026-10-19
-
관측됨 PROJECT_COMPILE exit 101 E0599 ×1 1.16.3 os=linux sha256:ff95f88fed26…error[E0599]: no associated function or constant named `new` found for struct `addr2line::Context<R>` in the current scoperust/rustc · compiler-diagnostic · outer cargo test증거 품질: complete · 환경 변형: 1 · 최초 관측: 2026-10-19 · 마지막 관측: 2026-10-19
-
관측됨 PROJECT_TEST exit 101 E0432 ×1 1.16.3 os=linux sha256:c4faf3580ad8…34 | let ctx = Context::new(&obj_file).expect(<str>); · | ^^^ associated function or constant not found in `addr2line::Context<_>` · | …rust/test · test-runner-diagnostic · outer cargo test증거 품질: complete · 환경 변형: 1 · 최초 관측: 2026-10-19 · 마지막 관측: 2026-10-19
-
관측됨 PROJECT_COMPILE exit 101 E0308 ×1 1.16.3 os=linux sha256:0479254218ac…error[E0308]: mismatched typesrust/rustc · compiler-diagnostic · outer cargo run증거 품질: complete · 환경 변형: 1 · 최초 관측: 2026-10-19 · 마지막 관측: 2026-10-19
-
관측됨 PROJECT_COMPILE exit 101 ×1 1.16.3 os=linux sha256:4c786cbbce8a…error: could not compile `sample` (bin <str>) due to 1 previous errorrust/rustc · compiler-diagnostic · outer cargo run증거 품질: complete · 환경 변형: 1 · 최초 관측: 2026-10-19 · 마지막 관측: 2026-10-19