Aufzeichnungencargosmallvec1.16.3
Bedingungen ändern
Aktuelle Bedingungen
smallvec @1.16.3ubuntu glibc · x64 · cargo 1
Paketsumme, keine API
19 von 31 bestanden
Beobachtet — echte Projekt-Builds haben von dieser Koordinate berichtet.
an dieser Koordinate noch kein Sample
- Projektbeobachtungen
- 19 / 31
- Contract-Verifikationen
- nichts an dieser Koordinate
- Nutzungsdatensätze
- 1
- Unabhängig meldende Peers
- 1
- Zuletzt erfasst
- 2026-10-20
Nachweise zum Öffnen
Abhängigkeits-Zustand
Eine Auflösung hat den Baum dieses Releases gelesen und keine Abhängigkeiten gefunden. Das ist eine Messung, keine fehlende.
Aktuelle Fehler-Cluster
-
beobachtet PROJECT_TEST exit 101 ×2 1.16.3 os=linux sha256:4f232600c5a8…error: test failed, to rerun pass `--test contract` · running 0 tests …rust/test · test-runner-diagnostic · outer cargo testBeweisqualität: complete · Umgebungsvarianten: 1 · Zuerst erfasst: 2026-10-20 · Zuletzt gesehen: 2026-10-20
-
beobachtet PROJECT_COMPILE exit 101 ×1 1.16.3 os=linux sha256:5f8e4e2b88b7…error: could not compile `sample-idna-adapter` (bin <str>) due to 2 previous errorsrust/rustc · compiler-diagnostic · outer cargo runBeweisqualität: complete · Umgebungsvarianten: 1 · Zuerst erfasst: 2026-10-19 · Zuletzt gesehen: 2026-10-19
-
beobachtet PROJECT_COMPILE exit 101 E0599 ×1 1.16.3 os=linux sha256:c2fafad2bab2…error[E0599]: no method named `is_rtl` found for struct `BidiClass` in the current scoperust/rustc · compiler-diagnostic · outer cargo runBeweisqualität: complete · Umgebungsvarianten: 1 · Zuerst erfasst: 2026-10-19 · Zuletzt gesehen: 2026-10-19
-
beobachtet PROJECT_COMPILE exit 101 ×1 1.16.3 os=linux sha256:6d7f0ce8254c…error: could not compile `sample-idna-adapter` (bin <str>) due to 1 previous errorrust/rustc · compiler-diagnostic · outer cargo buildBeweisqualität: complete · Umgebungsvarianten: 1 · Zuerst erfasst: 2026-10-19 · Zuletzt gesehen: 2026-10-19
-
beobachtet PROJECT_COMPILE exit 101 E0599 ×1 1.16.3 os=linux sha256:b07a18e8da2b…error[E0599]: no associated function or constant named `new` found for struct `Adapter` in the current scoperust/rustc · compiler-diagnostic · outer cargo buildBeweisqualität: complete · Umgebungsvarianten: 1 · Zuerst erfasst: 2026-10-19 · Zuletzt gesehen: 2026-10-19
-
beobachtet PROJECT_COMPILE exit 101 ×1 1.16.3 os=linux sha256:aaf1990e27c5…error: could not compile `sample-addr2line` (test <str>) due to 2 previous errors …rust/rustc · compiler-diagnostic · outer cargo testBeweisqualität: complete · Umgebungsvarianten: 1 · Zuerst erfasst: 2026-10-19 · Zuletzt gesehen: 2026-10-19
-
beobachtet PROJECT_COMPILE exit 101 E0432 ×1 1.16.3 os=linux sha256:ac7324fdd333…error[E0432]: unresolved import `addr2line::object`rust/rustc · compiler-diagnostic · outer cargo testBeweisqualität: complete · Umgebungsvarianten: 1 · Zuerst erfasst: 2026-10-19 · Zuletzt gesehen: 2026-10-19
-
beobachtet PROJECT_COMPILE exit 101 E0599 ×1 1.16.3 os=linux sha256:ff95f88fed26…error[E0599]: no associated function or constant named `new` found for struct `addr2line::Context<R>` in the current scoperust/rustc · compiler-diagnostic · outer cargo testBeweisqualität: complete · Umgebungsvarianten: 1 · Zuerst erfasst: 2026-10-19 · Zuletzt gesehen: 2026-10-19
-
beobachtet PROJECT_TEST exit 101 E0432 ×1 1.16.3 os=linux sha256:c4faf3580ad8…34 | let ctx = Context::new(&obj_file).expect(<str>); · | ^^^ associated function or constant not found in `addr2line::Context<_>` · | …rust/test · test-runner-diagnostic · outer cargo testBeweisqualität: complete · Umgebungsvarianten: 1 · Zuerst erfasst: 2026-10-19 · Zuletzt gesehen: 2026-10-19
-
beobachtet PROJECT_COMPILE exit 101 E0308 ×1 1.16.3 os=linux sha256:0479254218ac…error[E0308]: mismatched typesrust/rustc · compiler-diagnostic · outer cargo runBeweisqualität: complete · Umgebungsvarianten: 1 · Zuerst erfasst: 2026-10-19 · Zuletzt gesehen: 2026-10-19
-
beobachtet PROJECT_COMPILE exit 101 ×1 1.16.3 os=linux sha256:4c786cbbce8a…error: could not compile `sample` (bin <str>) due to 1 previous errorrust/rustc · compiler-diagnostic · outer cargo runBeweisqualität: complete · Umgebungsvarianten: 1 · Zuerst erfasst: 2026-10-19 · Zuletzt gesehen: 2026-10-19