Relevéscargosmallvec1.16.3
Changer les conditions
Conditions actuelles
smallvec @1.16.3ubuntu glibc · x64 · cargo 1
total du paquet, pas une API
19 sur 31 ont réussi
Observé — de vrais builds de projets ont fait remonter cette coordonnée.
pas encore d'échantillon à cette coordonnée
- Observations de projets
- 19 / 31
- Vérifications de contrat
- rien à cette coordonnée
- Enregistrements d'usage
- 1
- Pairs rapporteurs indépendants
- 1
- Dernier enregistrement
- 2026-10-20
Preuves que vous pouvez ouvrir
Santé des dépendances
Une résolution a lu l'arbre de cette version et n'a trouvé aucune dépendance. C'est une mesure, pas une mesure manquante.
Clusters d'échecs récents
-
observé PROJECT_TEST exit 101 ×2 1.16.3 os=linux sha256:4f232600c5a8…error: test failed, to rerun pass `--test contract` · running 0 tests …rust/test · test-runner-diagnostic · outer cargo testQualité de preuve: complete · Variantes d’environnement: 1 · Premier relevé: 2026-10-20 · Dernière observation: 2026-10-20
-
observé PROJECT_COMPILE exit 101 ×1 1.16.3 os=linux sha256:5f8e4e2b88b7…error: could not compile `sample-idna-adapter` (bin <str>) due to 2 previous errorsrust/rustc · compiler-diagnostic · outer cargo runQualité de preuve: complete · Variantes d’environnement: 1 · Premier relevé: 2026-10-19 · Dernière observation: 2026-10-19
-
observé PROJECT_COMPILE exit 101 E0599 ×1 1.16.3 os=linux sha256:c2fafad2bab2…error[E0599]: no method named `is_rtl` found for struct `BidiClass` in the current scoperust/rustc · compiler-diagnostic · outer cargo runQualité de preuve: complete · Variantes d’environnement: 1 · Premier relevé: 2026-10-19 · Dernière observation: 2026-10-19
-
observé PROJECT_COMPILE exit 101 ×1 1.16.3 os=linux sha256:6d7f0ce8254c…error: could not compile `sample-idna-adapter` (bin <str>) due to 1 previous errorrust/rustc · compiler-diagnostic · outer cargo buildQualité de preuve: complete · Variantes d’environnement: 1 · Premier relevé: 2026-10-19 · Dernière observation: 2026-10-19
-
observé PROJECT_COMPILE exit 101 E0599 ×1 1.16.3 os=linux sha256:b07a18e8da2b…error[E0599]: no associated function or constant named `new` found for struct `Adapter` in the current scoperust/rustc · compiler-diagnostic · outer cargo buildQualité de preuve: complete · Variantes d’environnement: 1 · Premier relevé: 2026-10-19 · Dernière observation: 2026-10-19
-
observé PROJECT_COMPILE exit 101 ×1 1.16.3 os=linux sha256:aaf1990e27c5…error: could not compile `sample-addr2line` (test <str>) due to 2 previous errors …rust/rustc · compiler-diagnostic · outer cargo testQualité de preuve: complete · Variantes d’environnement: 1 · Premier relevé: 2026-10-19 · Dernière observation: 2026-10-19
-
observé PROJECT_COMPILE exit 101 E0432 ×1 1.16.3 os=linux sha256:ac7324fdd333…error[E0432]: unresolved import `addr2line::object`rust/rustc · compiler-diagnostic · outer cargo testQualité de preuve: complete · Variantes d’environnement: 1 · Premier relevé: 2026-10-19 · Dernière observation: 2026-10-19
-
observé PROJECT_COMPILE exit 101 E0599 ×1 1.16.3 os=linux sha256:ff95f88fed26…error[E0599]: no associated function or constant named `new` found for struct `addr2line::Context<R>` in the current scoperust/rustc · compiler-diagnostic · outer cargo testQualité de preuve: complete · Variantes d’environnement: 1 · Premier relevé: 2026-10-19 · Dernière observation: 2026-10-19
-
observé PROJECT_TEST exit 101 E0432 ×1 1.16.3 os=linux sha256:c4faf3580ad8…34 | let ctx = Context::new(&obj_file).expect(<str>); · | ^^^ associated function or constant not found in `addr2line::Context<_>` · | …rust/test · test-runner-diagnostic · outer cargo testQualité de preuve: complete · Variantes d’environnement: 1 · Premier relevé: 2026-10-19 · Dernière observation: 2026-10-19
-
observé PROJECT_COMPILE exit 101 E0308 ×1 1.16.3 os=linux sha256:0479254218ac…error[E0308]: mismatched typesrust/rustc · compiler-diagnostic · outer cargo runQualité de preuve: complete · Variantes d’environnement: 1 · Premier relevé: 2026-10-19 · Dernière observation: 2026-10-19
-
observé PROJECT_COMPILE exit 101 ×1 1.16.3 os=linux sha256:4c786cbbce8a…error: could not compile `sample` (bin <str>) due to 1 previous errorrust/rustc · compiler-diagnostic · outer cargo runQualité de preuve: complete · Variantes d’environnement: 1 · Premier relevé: 2026-10-19 · Dernière observation: 2026-10-19