Relevéscargoserde_derive1.0.229serde_derive::Serialize
Changer les conditions
Conditions actuelles
serde_derive::Serialize @1.0.229linux · glibc · x64 · cargo 1
4 sur 4 ont réussi
Observé — de vrais builds de projets ont fait remonter cette coordonnée.
pas encore d'échantillon à cette coordonnée
- Observations de projets
- 4 / 4
- Vérifications de contrat
- rien à cette coordonnée
- Pairs rapporteurs indépendants
- 1
- Dernier enregistrement
- 2026-09-14
Preuves que vous pouvez ouvrir
Santé des dépendances
Combinaisons observées et preuves d'échec pour cette version
Problèmes observés : 1 ·
Inconnu(s) : 1 ·
Stable(s) : 4
Premier échec observé
1.0.229
linux
1 FAIL
· stage: PROJECT_COMPILE
· fingerprint: sha256:4cea358679576b2487958ac4034dc10b763a092bf4d66041d30899a2beb10162
| Bibliothèque | Version | Santé | Mesuré là-bas | Projets |
|---|---|---|---|---|
| syn | 3.0.6 | UNKNOWN Aucun résultat mesuré lié | rien de mesuré | 42 jours-projet |
| proc-macro2 | 1.0.107 | PASS Toutes les observations ont réussi | contrat réussi | 75 jours-projet |
| quote | 1.0.47 | PASS Toutes les observations ont réussi | contrat réussi | 75 jours-projet |
| syn | 3.0.3 | PASS Toutes les observations ont réussi | contrat réussi | 22 jours-projet |
| syn | 3.0.5 | PASS Toutes les observations ont réussi | contrat réussi | 11 jours-projet |
La colonne de mesure porte sur la version de chaque dépendance elle-même, pas sur la paire. Qu'un résolveur ait placé deux versions côte à côte ne prouve pas qu'elles fonctionnent ensemble.
Clusters d'échecs récents
-
observé PROJECT_COMPILE exit 101 E0433 ×1 1.0.229 os=linux sha256:4cea35867957…error[E0433]: cannot find `__private229` in `_serde` · error[E0433]: cannot find `Serializer` in `_serde` · error[E0433]: cannot find `ser` in `_serde`rust/rustc · compiler-diagnostic · outer cargo checkQualité de preuve: complete · Variantes d’environnement: 1 · Premier relevé: 2026-09-14 · Dernière observation: 2026-09-14
-
observé PROJECT_COMPILE exit 101 E0283 ×1 1.0.229 os=linux sha256:55052d6fc8b2…error[E0283]: type annotations neededrust/rustc · compiler-diagnostic · outer cargo runQualité de preuve: complete · Variantes d’environnement: 1 · Premier relevé: 2026-09-14 · Dernière observation: 2026-09-14
-
observé PROJECT_COMPILE exit 101 ×1 1.0.229 os=linux sha256:7461bf46226d…error: could not compile `sample-serde-core` (bin <str>) due to 3 previous errorsrust/rustc · compiler-diagnostic · outer cargo runQualité de preuve: complete · Variantes d’environnement: 1 · Premier relevé: 2026-09-14 · Dernière observation: 2026-09-14
-
observé PROJECT_COMPILE exit 101 E0405 ×1 1.0.229 os=linux sha256:8a1088019b07…error[E0405]: cannot find trait `Serialize` in module `_serde` · error[E0405]: cannot find trait `Serializer` in module `_serde`rust/rustc · compiler-diagnostic · outer cargo checkQualité de preuve: complete · Variantes d’environnement: 1 · Premier relevé: 2026-09-14 · Dernière observation: 2026-09-14
-
observé PROJECT_COMPILE exit 101 ×1 1.0.229 os=linux sha256:b21c095b1aba…error: could not compile `sample-serde-core` (bin <str>) due to 1 previous errorrust/rustc · compiler-diagnostic · outer cargo runQualité de preuve: complete · Variantes d’environnement: 1 · Premier relevé: 2026-09-14 · Dernière observation: 2026-09-14
-
observé PROJECT_COMPILE exit 101 ×1 1.0.229 os=linux sha256:df160d9ca814…error: could not compile `sample-serde-derive` (bin <str>) due to 7 previous errorsrust/rustc · compiler-diagnostic · outer cargo checkQualité de preuve: complete · Variantes d’environnement: 1 · Premier relevé: 2026-09-14 · Dernière observation: 2026-09-14
-
observé PROJECT_COMPILE exit 101 E0599 ×1 1.0.229 os=linux sha256:f713b890152f…error[E0599]: no method named `into_deserializer` found for enum `std::option::Option<T>` in the current scope …rust/rustc · compiler-diagnostic · outer cargo runQualité de preuve: complete · Variantes d’environnement: 1 · Premier relevé: 2026-09-14 · Dernière observation: 2026-09-14
-
observé UNKNOWN exit 101 Lacune de preuve ×1 1.0.229 os=linux sha256:eeb9864183a6…Compiling sample-serde-core v1.0.0 (<path> · Finished `dev` profile [unoptimized + debuginfo] target(s) in 0.27s · Running `target/debug/contract` …cargo · unclassified-diagnostic · outer cargo run · gap stage-unknownQualité de preuve: complete · Variantes d’environnement: 1 · Premier relevé: 2026-09-14 · Dernière observation: 2026-09-14Candidat à une revérification diagnostique