Registroscargoserde1.0.229
Mudar as condições
Condições atuais
serde @1.0.229ubuntu glibc · x64 · cargo 1
total do pacote, não uma API
0 de 4 passaram
Verificado — esta rede executou um contrato nesta coordenada.
há uma amostra aqui e nossa execução nesta coordenada falhou (11)
- Observações de projetos
- 69 / 89
- Verificações de contrato
- 0 / 4
- Registros de uso
- 10
- Peers independentes que reportaram
- 1
- Último registro
- 2026-10-10
Evidências que você pode abrir
Saúde das dependências
Combinações observadas e evidências de falha para esta versão
Problemas observados: 1 ·
Estáveis: 4
Primeira quebra observada
1.0.229
linux
5 FAIL
· stage: PROJECT_COMPILE
· fingerprint: sha256:113664d7d9181e86107a4fb50e44d53895730e410223b707c0b72d659b247aef
| Biblioteca | Versão | Saúde | Medido ali | Projetos |
|---|---|---|---|---|
| serde_core | 1.0.229 | PASS Todas as observações passaram | contrato aprovado | 81 dias-projeto |
| serde_derive | 1.0.229 | PASS Todas as observações passaram | contrato aprovado | 65 dias-projeto |
| serde_json | 1.0.149 | PASS Todas as observações passaram | contrato aprovado | 1 dia-projeto |
| serde_json | 1.0.151 | PASS Todas as observações passaram | contrato aprovado | 7 dias-projeto |
A coluna de medição é sobre a versão de cada dependência em si, não sobre o par. Um resolvedor ter colocado duas versões lado a lado não é prova de que funcionam juntas.
Clusters de falha recentes
-
observado PROJECT_COMPILE exit 101 ×5 1.0.229 os=linux sha256:113664d7d918…error: could not compile `probe_icu` (bin <str>) due to 1 previous errorrust/rustc · compiler-diagnostic · outer cargo runQualidade da evidência: complete · Variantes de ambiente: 1 · Primeiro registro: 2026-09-20 · Visto por último: 2026-09-20
-
observado PROJECT_TEST Lacuna de evidência ×1 1.0.229 executionContext=rust · os=linux · runtime=rust@1Qualidade da evidência: legacy-evidence-incomplete · Variantes de ambiente: 1 · Primeiro registro: 2026-09-08 · Visto por último: 2026-09-08
-
observado PROJECT_COMPILE exit 101 E0599 ×1 1.0.229 os=linux sha256:0fbd73add053…error[E0599]: no method named `is_empty` found for struct `Char16Trie<'data>` in the current scoperust/rustc · compiler-diagnostic · outer cargo runQualidade da evidência: complete · Variantes de ambiente: 1 · Primeiro registro: 2026-09-20 · Visto por último: 2026-09-20
-
observado PROJECT_COMPILE exit 101 E0599 ×1 1.0.229 os=linux sha256:16d23d1801b1…error[E0599]: no method named `normalize` found for struct `ComposingNormalizer` in the current scoperust/rustc · compiler-diagnostic · outer cargo runQualidade da evidência: complete · Variantes de ambiente: 1 · Primeiro registro: 2026-09-20 · Visto por último: 2026-09-20
-
observado PROJECT_COMPILE exit 101 E0277 ×1 1.0.229 os=linux sha256:208766dc43dd…error[E0277]: the trait bound `DirectULE: AsULE` is not satisfied · error[E0277]: the size for values of type `[_]` cannot be known at compilation timerust/rustc · compiler-diagnostic · outer cargo runQualidade da evidência: complete · Variantes de ambiente: 1 · Primeiro registro: 2026-09-21 · Visto por último: 2026-09-21
-
observado PROJECT_COMPILE exit 101 E0716 ×1 1.0.229 os=linux sha256:24047988143e…error[E0716]: temporary value dropped while borrowedrust/rustc · compiler-diagnostic · outer cargo runQualidade da evidência: complete · Variantes de ambiente: 1 · Primeiro registro: 2026-09-21 · Visto por último: 2026-09-21
-
observado PROJECT_COMPILE exit 101 E0599 ×1 1.0.229 os=linux sha256:267702ebcc26…error[E0599]: no associated function or constant named `new_nfc_unstable` found for struct `ComposingNormalizer` in the current scoperust/rustc · compiler-diagnostic · outer cargo runQualidade da evidência: complete · Variantes de ambiente: 1 · Primeiro registro: 2026-09-20 · Visto por último: 2026-09-20
-
observado PROJECT_COMPILE exit 101 E0599 ×1 1.0.229 os=linux sha256:2c8ce33ea821…error[E0599]: no method named `to_aligned` found for reference `&RawBytesULE<4>` in the current scoperust/rustc · compiler-diagnostic · outer cargo runQualidade da evidência: complete · Variantes de ambiente: 1 · Primeiro registro: 2026-09-21 · Visto por último: 2026-09-21
-
observado PROJECT_COMPILE exit 101 ×1 1.0.229 os=linux sha256:4518371e6dd8…error: could not compile `test-zerovec` (bin <str>) due to 1 previous errorrust/rustc · compiler-diagnostic · outer cargo runQualidade da evidência: complete · Variantes de ambiente: 1 · Primeiro registro: 2026-09-21 · Visto por último: 2026-09-21
-
observado PROJECT_COMPILE exit 101 E0609 ×1 1.0.229 os=linux sha256:463107715912…error[E0609]: no field `SINGLETON_NORMALIZER_NFC_V1` on type `MyProvider`rust/rustc · compiler-diagnostic · outer cargo runQualidade da evidência: complete · Variantes de ambiente: 1 · Primeiro registro: 2026-09-20 · Visto por último: 2026-09-20
-
observado PROJECT_COMPILE exit 101 ×1 1.0.229 os=linux sha256:4880cde154a0…error: could not compile `probe_zerovec` (bin <str>) due to 3 previous errors; 1 warning emittedrust/rustc · compiler-diagnostic · outer cargo runQualidade da evidência: complete · Variantes de ambiente: 1 · Primeiro registro: 2026-09-21 · Visto por último: 2026-09-21
-
observado PROJECT_COMPILE exit 101 E0277 ×1 1.0.229 os=linux sha256:86285648d445…error[E0277]: the trait bound `Person<'_>: VarULE` is not satisfiedrust/rustc · compiler-diagnostic · outer cargo runQualidade da evidência: complete · Variantes de ambiente: 1 · Primeiro registro: 2026-09-21 · Visto por último: 2026-09-21
Mostrando os 12 mais relatados de 21 grupos de falhas registrados. O resto são relatos únicos.